3-Hexene, 2,3-dimethyl-
- Formula: C8H16
- Molecular weight: 112.2126
- IUPAC Standard InChIKey: PRTXQHCLTIKAAJ-UHFFFAOYSA-N
- CAS Registry Number: 7145-23-5
- Chemical structure:
View 3d structure (requires JavaScript / HTML 5) - Stereoisomers:
- Other names: 2,3-Dimethyl-3-hexene

Kovats' RI, non-polar column, isothermal

Column type | Active phase | Temperature (C) | I | Reference | Comment |
---|---|---|---|---|---|
Packed | Squalane | 30. | 754.5 | Tourres, 1967 | H2; Column length: 10. m |
Packed | Squalane | 50. | 756. | Tourres, 1967 | H2; Column length: 10. m |

References

Tourres, 1967
Tourres, D.A.,
Structural analysis of industrial butene dimers by gas chromatography,
J. Gas Chromatogr., 1967, 5, 1, 35-40, https://doi.org/10.1093/chromsci/5.1.35
. [all data]