1-Nitro-2-propylbenzene
- Formula: C9H11NO2
- Molecular weight: 165.1891
- IUPAC Standard InChIKey: UGAXDAGIKIVCQB-UHFFFAOYSA-N
- CAS Registry Number: 7137-54-4
- Chemical structure:
View 3d structure (requires JavaScript / HTML 5) - Other names: Benzene, 1-nitro-2-propyl-; o-Propylnitrobenzene; o-Nitropropylbenzene

Phase change data

Data compiled by: Robert L. Brown and Stephen E. Stein
Reduced pressure boiling point
Tboil (K) | Pressure (bar) | Reference |
---|---|---|
407.7 | 0.035 | Aldrich Chemical Company Inc., 1990 |

Kovats' RI, polar column, isothermal

Column type | Active phase | Temperature (C) | I | Reference | Comment |
---|---|---|---|---|---|
Packed | Carbowax 20M | 200. | 1969. | Vernon and Suratman, 1983 | He, Silanized white support; Column length: 2. m |

References

Aldrich Chemical Company Inc., 1990
Aldrich Chemical Company Inc.,
Catalog Handbook of Fine Chemicals, Aldrich Chemical Company, Inc., Milwaukee WI, 1990, 1. [all data]
Vernon and Suratman, 1983
Vernon, F.; Suratman, J.B.,
The retention index system applied to alkylbenzenes and monosubstituted derivatives,
Chromatographia, 1983, 17, 11, 600-604, https://doi.org/10.1007/BF02261943
. [all data]