Dimethyl(pentafluorophenyl)silyloxymethylbenzene
- Formula: C15H13F5OSi
- Molecular weight: 332.3406
- IUPAC Standard InChIKey: PUJFMMQJFLXFTF-UHFFFAOYSA-N
- CAS Registry Number: 71338-90-4
- Chemical structure:

Kovats' RI, non-polar column, custom temperature program

Column type | Active phase | I | Reference | Comment |
---|---|---|---|---|
Packed | SE-30 | 1520. | Francis, Morgan, et al., 1978 | N2, Chromosorb P AW DMCS; Column length: 2. m; Program: not specified |

References

Francis, Morgan, et al., 1978
Francis, A.J.; Morgan, E.D.; Poole, C.F.,
Flophemesyl Derivatives of Alcohols, Phenols, Amines and Carboxylic Acids and Their Use in Gas Chromatography with Electron-Capture Detection,
J. Chromatogr., 1978, 161, 111-117, https://doi.org/10.1016/S0021-9673(01)85218-3
. [all data]