2-Methyl-1-dimethyl(pentafluorophenyl)silyloxypropane
- Formula: C12H15F5OSi
- Molecular weight: 298.3244
- IUPAC Standard InChIKey: UXHWWUWXTZKTRA-UHFFFAOYSA-N
- CAS Registry Number: 71338-75-5
- Chemical structure:
View 3d structure (requires JavaScript / HTML 5) - Other names: Isobutanol DMPFPS; 2-Methylpropanol, dimethylpentafluorophenylsilyl ether

Kovats' RI, non-polar column, custom temperature program

Column type | Active phase | I | Reference | Comment |
---|---|---|---|---|
Packed | SE-30 | 1270. | Francis, Morgan, et al., 1978 | N2, Chromosorb P AW DMCS; Column length: 2. m; Program: not specified |

Van Den Dool and Kratz RI, non-polar column, temperature ramp

Column type | Active phase | I | Reference | Comment |
---|---|---|---|---|
Capillary | 5 % Phenyl methyl siloxane | 1242. | Zaikin, 2010 | 30. m/0.25 mm/0.25 μm, 15. K/min, 270. C @ 15. min; Tstart: 60. C |

References

Francis, Morgan, et al., 1978
Francis, A.J.; Morgan, E.D.; Poole, C.F.,
Flophemesyl Derivatives of Alcohols, Phenols, Amines and Carboxylic Acids and Their Use in Gas Chromatography with Electron-Capture Detection,
J. Chromatogr., 1978, 161, 111-117, https://doi.org/10.1016/S0021-9673(01)85218-3
. [all data]
Zaikin, 2010
Zaikin, V.G.,
Personal communication: Retention indices measured during 2010, 2010. [all data]