Pentadecanoic acid, methyl ester
- Formula: C16H32O2
- Molecular weight: 256.4241
- IUPAC Standard InChIKey: XIUXKAZJZFLLDQ-UHFFFAOYSA-N
- CAS Registry Number: 7132-64-1
- Chemical structure:
View 3d structure (requires JavaScript / HTML 5) - Other names: Methyl n-pentadecanoate; Methyl pentadecanoate; n-Pentadecanoic acid methyl ester; 25:0, Me ester

Condensed phase thermochemistry data

Data compiled by: Hussein Y. Afeefy, Joel F. Liebman, and Stephen E. Stein
Quantity | Value | Units | Method | Reference | Comment |
---|---|---|---|---|---|
ΔcH°liquid | -10097.9 ± 1.5 | kJ/mol | Ccb | Adriaanse, Dekker, et al., 1965 | Corresponding ΔfHºliquid = -771.5 kJ/mol (simple calculation by NIST; no Washburn corrections) |

Phase change data

Data compiled as indicated in comments:
BS - Robert L. Brown and Stephen E. Stein
TRC - Thermodynamics Research Center, NIST Boulder Laboratories, Chris Muzny director
AC - William E. Acree, Jr., James S. Chickos
ALS - Hussein Y. Afeefy, Joel F. Liebman, and Stephen E. Stein
Quantity | Value | Units | Method | Reference | Comment |
---|---|---|---|---|---|
Tfus | 291.45 | K | N/A | Gaikwad and Subrahmanyam, 1985 | Uncertainty assigned by TRC = 0.3 K; TRC |
Tfus | 380.3 | K | N/A | Plato, 1972 | Uncertainty assigned by TRC = 0.2 K; TRC |
Tfus | 288.61 | K | N/A | Ruhoff and Reid, 1933 | Uncertainty assigned by TRC = 0.15 K; TRC |
Quantity | Value | Units | Method | Reference | Comment |
ΔvapH° | 91. ± 4. | kJ/mol | AVG | N/A | Average of 6 values; Individual data points |
Reduced pressure boiling point
Tboil (K) | Pressure (bar) | Reference | Comment |
---|---|---|---|
414.7 | 0.004 | Aldrich Chemical Company Inc., 1990 | BS |
Enthalpy of vaporization
ΔvapH (kJ/mol) | Temperature (K) | Method | Reference | Comment |
---|---|---|---|---|
82.1 | 350. | N/A | Segura, Galindo, et al., 2002 | AC |
79.8 ± 0.2 | 372. | N/A | Segura, Galindo, et al., 2002 | AC |
78.3 | 415. | A,E | Stephenson and Malanowski, 1987 | Based on data from 400. to 527. K. See also Rose and Schrodt, 1963.; AC |
87.9 ± 1.3 | 299. | N/A | Baccanari, Novinski, et al., 1968 | Based on data from 295. to 303. K.; AC |

Lee's RI, non-polar column, temperature ramp

Data compiled by: NIST Mass Spectrometry Data Center, William E. Wallace, director

Column type CapillaryCapillaryCapillaryCapillaryCapillary
Active phase DB-1DB-1DB-1DB-5DB-5
Column length (m) 30.30.30.30.30.
Carrier gas    N2He
Substrate
Column diameter (mm) 0.20.20.20.250.26
Phase thickness (μm) 0.250.250.250.2150.25
Tstart (C) 50.50.50.50.50.
Tend (C) 300.300.300.300.300.
Heat rate (K/min) 5.5.5.6.6.
Initial hold (min) 2.2.2.4.4.
Final hold (min) 5.5.5.20.20.
I 314.6314.6314.7305.43305.23
ReferenceJohnson, Urso, et al., 1997Johnson, Urso, et al., 1997Johnson, Urso, et al., 1997Wang, Jin, et al., 1992Rostad and Pereira, 1986
Comment MSDC-RI MSDC-RI MSDC-RI MSDC-RI MSDC-RI

Normal alkane RI, polar column, custom temperature program

Data compiled by: NIST Mass Spectrometry Data Center, William E. Wallace, director

Column type Capillary
Active phase Innowax
Column length (m) 60.
Carrier gas
Substrate
Column diameter (mm) 0.25
Phase thickness (μm) 0.33
Program not specified
I 2099.
ReferenceNoorizadeh, Farmany, et al., 2011
Comment MSDC-RI

References

Adriaanse, Dekker, et al., 1965
Adriaanse, N.; Dekker, H.; Coops, J.,
Heats of combustion of normal saturated fatty acids and their methyl esters,
Rec. Trav. Chim. Pays/Bas, 1965, 84, 393-407. [all data]
Gaikwad and Subrahmanyam, 1985
Gaikwad, B.R.; Subrahmanyam, V.V.,
Melting behavior of fatty alcohols and their binary blends.,
J. Indian Chem. Soc., 1985, 62, 513. [all data]
Plato, 1972
Plato, C.,
DSC as a general method for determining purity and heat of fusion of high-purity organic chemicals,
Anal. Chem., 1972, 44, 1531. [all data]
Ruhoff and Reid, 1933
Ruhoff, J.R.; Reid, E.E.,
A group of isomeric esters,
J. Am. Chem. Soc., 1933, 55, 3825-8. [all data]
Aldrich Chemical Company Inc., 1990
Aldrich Chemical Company Inc.,
Catalog Handbook of Fine Chemicals, Aldrich Chemical Company, Inc., Milwaukee WI, 1990, 1. [all data]
Segura, Galindo, et al., 2002
Segura, Hugo; Galindo, Graciela; Reich, Ricardo; Wisniak, Jaime; Loras, Sonia,
Isobaric Vapor-Liquid Equilibria and Densities for the System Methyl 1,1-Dimethylethyl Ether +2-Propanol,
Physics and Chemistry of Liquids, 2002, 40, 3, 277-294, https://doi.org/10.1080/0031910021000004865
. [all data]
Stephenson and Malanowski, 1987
Stephenson, Richard M.; Malanowski, Stanislaw,
Handbook of the Thermodynamics of Organic Compounds, 1987, https://doi.org/10.1007/978-94-009-3173-2
. [all data]
Rose and Schrodt, 1963
Rose, Arthur; Schrodt, Verle N.,
Correlation and Prediction of Vapor Pressures of Homologs. Use of Structure Parameters and Gas Chromatography Data.,
J. Chem. Eng. Data, 1963, 8, 1, 9-13, https://doi.org/10.1021/je60016a002
. [all data]
Baccanari, Novinski, et al., 1968
Baccanari, D.P.; Novinski, J.A.; Pan, Y.; Yevitz, M.M.; Swain, H.A., Jr.,
Heats of sublimation and vaporization at 25° of long chain fatty acids and methyl esters,
Trans. Faraday Soc., 1968, 64, 1201. [all data]