1,2,4,5-Benzenetetracarbonitrile
- Formula: C10H2N4
- Molecular weight: 178.1497
- IUPAC Standard InChIKey: FAAXSAZENACQBT-UHFFFAOYSA-N
- CAS Registry Number: 712-74-3
- Chemical structure:
View 3d structure (requires JavaScript / HTML 5) - Other names: s-Tetracyanobenzene; Benzene, 1,2,4,5-tetracyano-; Pyromellitic tetranitrile; Pyromellitonitrile; Pyromellitotetranitrile; 1,2,4,5-Benzenetetranitrile; 1,2,4,5-Tetracyanobenzene; 1,2,4,5-Benzentetrakarbonitril; sym-Tetracyanobenzene; Pyromellitic acid tetranitrile; Pyromellitic nitrile

Condensed phase thermochemistry data

Data compiled by: Eugene S. Domalski and Elizabeth D. Hearing
Quantity | Value | Units | Method | Reference | Comment |
---|---|---|---|---|---|
S°solid,1 bar | 252.7 | J/mol*K | N/A | Clayton, Worswick, et al., 1976 |
Constant pressure heat capacity of solid
Cp,solid (J/mol*K) | Temperature (K) | Reference | Comment |
---|---|---|---|
222.3 | 298.15 | Clayton, Worswick, et al., 1976 | T = 5 to 300 K. |

Gas phase ion energetics data

Data compiled by: John E. Bartmess
Electron affinity determinations
EA (eV) | Method | Reference | Comment |
---|---|---|---|
2.20 ± 0.22 | SI | Farragher and Page, 1967 | The Magnetron method, lacking mass analysis, is not considered reliable. G3MP2B3 calculations indicate an EA of ca. 2.5 eV |

References

Clayton, Worswick, et al., 1976
Clayton, P.R.; Worswick, R.D.; Staveley, L.A.K.,
The heat capacity of 1,2,4,5-tetracyanobenzene and of its 1:1 charge-transfer complex with pyrene from 10 K to 300 K,
Mol. Cryst. Liq. Cryst., 1976, 36, 153-163. [all data]
Farragher and Page, 1967
Farragher, A.L.; Page, F.M.,
Experimental Determination of Electron Affinities. Part 11. - Electron Capture by Some Cyanocarbons and Related Compounds,
Trans. Farad. Soc., 1967, 63, 2369, https://doi.org/10.1039/tf9676302369
. [all data]