1,1,1-Trichloro-3,3,3-trifluoropropane
- Formula: C3H2Cl3F3
- Molecular weight: 201.402
- IUPAC Standard InChIKey: MDNLZVVUMKSEKO-UHFFFAOYSA-N
- CAS Registry Number: 7125-84-0
- Chemical structure:
View 3d structure (requires JavaScript / HTML 5) - Species with the same structure:

Condensed phase thermochemistry data

Data compiled by: Hussein Y. Afeefy, Joel F. Liebman, and Stephen E. Stein
Quantity | Value | Units | Method | Reference | Comment |
---|---|---|---|---|---|
ΔfH°liquid | -198.53 ± 0.22 | kcal/mol | Ccr | Kolesov, Tomareva, et al., 1968 | HF(1:600 H2O) and HCl(1:600 H2O);hf298_gas[kcal/mol]=-192.14±0.53; Kolesov and Kozina, 1986 |
Quantity | Value | Units | Method | Reference | Comment |
ΔcH°liquid | -295.01 ± 0.22 | kcal/mol | Ccr | Kolesov, Tomareva, et al., 1968 | HF(1:600 H2O) and HCl(1:600 H2O);hf298_gas[kcal/mol]=-192.14±0.53; Kolesov and Kozina, 1986 |

Phase change data

Data compiled as indicated in comments:
TRC - Thermodynamics Research Center, NIST Boulder Laboratories, Chris Muzny director
AC - William E. Acree, Jr., James S. Chickos
Quantity | Value | Units | Method | Reference | Comment |
---|---|---|---|---|---|
Ttriple | 232.69 | K | N/A | Kolesov and Vorob'ev, 1971 | Uncertainty assigned by TRC = 0.02 K; TRC |
Quantity | Value | Units | Method | Reference | Comment |
ΔvapH° | 8.80 ± 0.02 | kcal/mol | C | Varushchenko, Druzhinina, et al., 2007 | AC |
Enthalpy of vaporization
ΔvapH (kcal/mol) | Temperature (K) | Reference | Comment |
---|---|---|---|
8.41 | 335. | Stephenson and Malanowski, 1987 | Based on data from 320. to 365. K.; AC |
Enthalpy of fusion
ΔfusH (kcal/mol) | Temperature (K) | Reference | Comment |
---|---|---|---|
3.363 | 232.7 | Acree, 1991 | AC |

References

Kolesov, Tomareva, et al., 1968
Kolesov, V.P.; Tomareva, E.M.; Skuratov, S.M.,
Standard enthalpies of formation of 1,1,1-Trifluoro-3-chloropropane and 1,1,1-trifluoro-3,3,3-trichloropropane,
Bull. Acad. Sci. USSR, Div. Chem. Sci. (Engl. Transl.), 1968, 23, 18-20, In original 30. [all data]
Kolesov and Kozina, 1986
Kolesov, V.P.; Kozina, M.P.,
Thermochemistry of organic and organohalogen compounds,
Russ. Chem. Rev., 1986, 55, 912. [all data]
Kolesov and Vorob'ev, 1971
Kolesov, V.P.; Vorob'ev, V.N.,
Heat Capacity at 12 - 300 K and Thermodynamic Functions of 1,1,1-Trichloro- 3,3,3-trifluoropropane,
Zh. Fiz. Khim., 1971, 45, 1293-4. [all data]
Varushchenko, Druzhinina, et al., 2007
Varushchenko, R.M.; Druzhinina, A.I.; Kuramshina, G.M.; Dorofeeva, O.V.,
Thermodynamics of vaporization of some freons and halogenated ethanes and propanes,
Fluid Phase Equilibria, 2007, 256, 1-2, 112-122, https://doi.org/10.1016/j.fluid.2007.02.017
. [all data]
Stephenson and Malanowski, 1987
Stephenson, Richard M.; Malanowski, Stanislaw,
Handbook of the Thermodynamics of Organic Compounds, 1987, https://doi.org/10.1007/978-94-009-3173-2
. [all data]
Acree, 1991
Acree, William E.,
Thermodynamic properties of organic compounds: enthalpy of fusion and melting point temperature compilation,
Thermochimica Acta, 1991, 189, 1, 37-56, https://doi.org/10.1016/0040-6031(91)87098-H
. [all data]