1,1,1-Trichloro-3,3,3-trifluoropropane
- Formula: C3H2Cl3F3
- Molecular weight: 201.402
- IUPAC Standard InChIKey: MDNLZVVUMKSEKO-UHFFFAOYSA-N
- CAS Registry Number: 7125-83-9
- Chemical structure:
View 3d structure (requires JavaScript / HTML 5) - Species with the same structure:

Condensed phase thermochemistry data

Data compiled by: Eugene S. Domalski and Elizabeth D. Hearing
Quantity | Value | Units | Method | Reference | Comment |
---|---|---|---|---|---|
S°liquid | 311.42 | J/mol*K | N/A | Kolesov and Vorob'ev, 1971 |
Constant pressure heat capacity of liquid
Cp,liquid (J/mol*K) | Temperature (K) | Reference | Comment |
---|---|---|---|
199.91 | 298.15 | Kolesov and Vorob'ev, 1971 | T = 12 to 300 K. Data in paper deposited at VINITI, No. 1760-70, 21 May 1970. |

Phase change data

Data compiled by: Eugene S. Domalski and Elizabeth D. Hearing
Enthalpy of fusion
ΔfusH (kJ/mol) | Temperature (K) | Reference | Comment |
---|---|---|---|
14.067 | 232.69 | Kolesov and Vorob'ev, 1971 |
Entropy of fusion
ΔfusS (J/mol*K) | Temperature (K) | Reference | Comment |
---|---|---|---|
60.45 | 232.69 | Kolesov and Vorob'ev, 1971 |

References

Kolesov and Vorob'ev, 1971
Kolesov, V.P.; Vorob'ev, V.N.,
Heat capacity at 12-300K and thermodynamic functions of 1,1,1-trichloro-3,3,3-trifluoropropane,
Zhur. Fiz. Khim., 1971, 45, 1293-1294. [all data]