Phenyl cyclohexyl ketone
- Formula: C13H16O
- Molecular weight: 188.2655
- IUPAC Standard InChIKey: BMFYCFSWWDXEPB-UHFFFAOYSA-N
- CAS Registry Number: 712-50-5
- Chemical structure:
View 3d structure (requires JavaScript / HTML 5) - Other names: Methanone, cyclohexylphenyl-; Ketone, cyclohexyl phenyl; Benzophenone, 1,2,3,4,5,6-hexahydro-; Benzoyl cyclohexane; Cyclohexyl phenyl ketone; USAF KF-3

Phase change data

Data compiled by: Robert L. Brown and Stephen E. Stein
Quantity | Value | Units | Method | Reference | Comment |
---|---|---|---|---|---|
Tfus | 332. to 333. | K | N/A | Buckingham and Donaghy, 1982 |
Reduced pressure boiling point
Tboil (K) | Pressure (bar) | Reference |
---|---|---|
437.7 | 0.024 | Weast and Grasselli, 1989 |
426. to 430. | 0.020 | Frinton Laboratories Inc., 1986 |
437. to 438. | 0.024 | Buckingham and Donaghy, 1982 |

Normal alkane RI, non-polar column, custom temperature program

Column type | Active phase | I | Reference | Comment |
---|---|---|---|---|
Capillary | Polydimethyl siloxanes | 1608. | Zenkevich and Chupalov, 1996 | Program: not specified |

References

Buckingham and Donaghy, 1982
Buckingham, J.; Donaghy, S.M.,
Dictionary of Organic Compounds: Fifth Edition, Chapman and Hall, New York, 1982, 1. [all data]
Weast and Grasselli, 1989
CRC Handbook of Data on Organic Compounds, 2nd Editon, Weast,R.C and Grasselli, J.G., ed(s)., CRC Press, Inc., Boca Raton, FL, 1989, 1. [all data]
Frinton Laboratories Inc., 1986
Frinton Laboratories Inc.,
Catalog Number 11, Frinton Laboratories Inc., Vineland, NJ, 1986, 99. [all data]
Bolshakov, et al., 1969
Bolshakov, G.F., et al.,
Ultraviolet Spectra of Heteroorganic Compounds, 1969, 269. [all data]
Zenkevich and Chupalov, 1996
Zenkevich, I.G.; Chupalov, A.A.,
New Possibilities of Chromato Mass Pectrometric Identification of Organic Compounds Using Increments of Gas Chromatographic Retention Indices of Molecular Structural Fragments,
Zh. Org. Khim. (Rus.), 1996, 32, 5, 656-666. [all data]