C2H5N

Gas phase ion energetics data

Data compiled by: John E. Bartmess

De-protonation reactions

C2H4N- + Hydrogen cation = C2H5N

By formula: C2H4N- + H+ = C2H5N

Quantity Value Units Method Reference Comment
Δr1578. ± 8.8kJ/molG+TSMo, Yanez, et al., 1999gas phase
Quantity Value Units Method Reference Comment
Δr1546. ± 8.4kJ/molIMRBMo, Yanez, et al., 1999gas phase

References

Mo, Yanez, et al., 1999
Mo, O.; Yanez, M.; Decouzon, M.; Gal, J.F.; Maria, P.C.; Guillemin, J.L., Gas-phase basicity and acidity trends in alpha,beta-unsaturated amines, phosphines, and arsines, J. Am. Chem. Soc., 1999, 121, 19, 4653-4663, https://doi.org/10.1021/ja982657e . [all data]