Piperidine, 1-nitro-
- Formula: C5H10N2O2
- Molecular weight: 130.1451
- IUPAC Standard InChIKey: PFHGNIMWELIXGP-UHFFFAOYSA-N
- CAS Registry Number: 7119-94-0
- Chemical structure:
View 3d structure (requires JavaScript / HTML 5) - Permanent link for this species. Use this link for bookmarking this species for future reference.

Gas phase thermochemistry data

Data compiled by: Hussein Y. Afeefy, Joel F. Liebman, and Stephen E. Stein
Quantity | Value | Units | Method | Reference | Comment |
---|---|---|---|---|---|
ΔfH°gas | -44. ± 3. | kJ/mol | Ccb | Matyushin, V'yunova, et al., 1971 |

Condensed phase thermochemistry data

Data compiled by: Hussein Y. Afeefy, Joel F. Liebman, and Stephen E. Stein
Quantity | Value | Units | Method | Reference | Comment |
---|---|---|---|---|---|
ΔfH°liquid | -93. ± 2. | kJ/mol | Ccb | Matyushin, V'yunova, et al., 1971 | |
Quantity | Value | Units | Method | Reference | Comment |
ΔcH°liquid | -3304. ± 2. | kJ/mol | Ccb | Matyushin, V'yunova, et al., 1971 |

Phase change data

Data compiled as indicated in comments:
BS - Robert L. Brown and Stephen E. Stein
TRC - Thermodynamics Research Center, NIST Boulder Laboratories, Chris Muzny director
ALS - Hussein Y. Afeefy, Joel F. Liebman, and Stephen E. Stein
Quantity | Value | Units | Method | Reference | Comment |
---|---|---|---|---|---|
Tfus | 267.65 | K | N/A | Bruhl, 1897 | Uncertainty assigned by TRC = 1. K; TRC |
Reduced pressure boiling point
Tboil (K) | Pressure (bar) | Reference | Comment |
---|---|---|---|
394.7 | 0.027 | Weast and Grasselli, 1989 | BS |
Enthalpy of vaporization
ΔvapH (kJ/mol) | Temperature (K) | Method | Reference | Comment |
---|---|---|---|---|
48.5 ± 0.8 | 323. | V | Matyushin, V'yunova, et al., 1971 | ALS |

References

Matyushin, V'yunova, et al., 1971
Matyushin, Yu.N.; V'yunova, I.B.; Pepekin, V.I.; Apin, A.Ya.,
Enthalpy of formation of the piperidyl radical,
Bull. Acad. Sci. USSR, Div. Chem. Sci., 1971, 2320-2323. [all data]
Bruhl, 1897
Bruhl, J.W.,
Spectrochemistry of nitrogen containing compounds V,
Z. Phys. Chem., Stoechiom. Verwandtschaftsl., 1897, 22, 373. [all data]
Weast and Grasselli, 1989
CRC Handbook of Data on Organic Compounds, 2nd Editon, Weast,R.C and Grasselli, J.G., ed(s)., CRC Press, Inc., Boca Raton, FL, 1989, 1. [all data]