Megastigma-4,6(E),8(Z)-triene
- Formula: C13H20
- Molecular weight: 176.2979
- IUPAC Standard InChIKey: BYDQKMZEOZVIJM-HFACTSAFSA-N
- CAS Registry Number: 71186-24-8
- Chemical structure:
View 3d structure (requires JavaScript / HTML 5) - Species with the same structure:
- Stereoisomers:
- Other names: Cyclohexene, 6-(2-butenylidene)-1,5,5-trimethyl-, (E,Z)-; megastigme-4,6(E),8(Z)-triene; 6-[2-Butenylidene]-1,5,5-trimethyl-1-cyclohexene, (E,Z)-isomer; Cyclohexene, 6-(2Z)-2-buten-1-ylidene-1,5,5-trimethyl-, (6E)-

Van Den Dool and Kratz RI, non-polar column, temperature ramp

Column type | Active phase | I | Reference | Comment |
---|---|---|---|---|
Capillary | DB-5 | 1354. | Gómez, Ledbetter, et al., 1993 | He, 4. K/min; Column length: 30. m; Column diameter: 0.25 mm; Tstart: 50. C; Tend: 250. C |

Van Den Dool and Kratz RI, polar column, temperature ramp

Column type | Active phase | I | Reference | Comment |
---|---|---|---|---|
Capillary | Supelcowax-10 | 1598. | Riu-Aumatell, Lopez-Tamames, et al., 2005 | 30. m/0.25 mm/0.25 μm, He, 60. C @ 5. min, 3. K/min, 240. C @ 10. min |

Normal alkane RI, non-polar column, temperature ramp

Column type | Active phase | I | Reference | Comment |
---|---|---|---|---|
Capillary | OV-1 | 1343. | Hu, Liang, et al., 2010 | 30. m/0.25 mm/0.25 μm, Helium, 50. C @ 3. min, 5. K/min, 250. C @ 2. min |

Normal alkane RI, non-polar column, custom temperature program

Column type | Active phase | I | Reference | Comment |
---|---|---|---|---|
Capillary | HP-5 | 1317. | Riu-Aumatell, Lopez-Tamames, et al., 2005 | Program: not specified |

References

Gómez, Ledbetter, et al., 1993
Gómez, E.; Ledbetter, C.A.; Hartsell, P.L.,
Volatile compounds in apricot, plum, and their interspecific hybrids,
J. Agric. Food Chem., 1993, 41, 10, 1669-1676, https://doi.org/10.1021/jf00034a029
. [all data]
Riu-Aumatell, Lopez-Tamames, et al., 2005
Riu-Aumatell, M.; Lopez-Tamames, E.; Buxaderas, S.,
Assessment of the Volatile Composition of Juices of Apricot, Peach, and Pear According to Two Pectolytic Treatments,
J. Agric. Food Chem., 2005, 53, 20, 7837-7843, https://doi.org/10.1021/jf051397z
. [all data]
Hu, Liang, et al., 2010
Hu, C.-D.; Liang, Y.-Z.; Guo, F.-Q.; Li, X.-R.; Wang, W.-P.,
Determination of essential oil composition from Osmanthus fragrans tea by GC-MS combined with a chemometric resolution method,
Molecules, 2010, 15, 5, 3683-3693, https://doi.org/10.3390/molecules15053683
. [all data]