Ethanone, 1-(1-hydroxy-2-naphthalenyl)-
- Formula: C11H10O2
- Molecular weight: 174.1959
- IUPAC Standard InChIKey: JBGJVMVWYWUVOW-UHFFFAOYSA-N
- CAS Registry Number: 711-79-5
- Chemical structure:
View 3d structure (requires JavaScript / HTML 5) - Other names: 2'-Acetonaphthone, 1'-hydroxy-; 1-Hydroxy-2-acetonaphthone; 1-Hydroxy-2-acetylnaphthalene; 1-Hydroxy-2-naphthyl methyl ketone; 2-Acetyl-1-hydroxynaphthalene; 2-Acetyl-1-naphthol; 3',4'-Benzo-2'-hydroxyacetophenone; 1'-Hydroxy-2'-acetonaphthone; 1-Hydroxy-2-acetonaphthalene; 2-Aceto-1-naphthol; NSC 4973; 1-(1-Hydroxy-2-naphthalenyl)ethanone

Phase change data

Data compiled as indicated in comments:
TRC - Thermodynamics Research Center, NIST Boulder Laboratories, Chris Muzny director
AC - William E. Acree, Jr., James S. Chickos
Quantity | Value | Units | Method | Reference | Comment |
---|---|---|---|---|---|
Tfus | 371.75 | K | N/A | Domanska, 1990 | Uncertainty assigned by TRC = 0.01 K; TRC |
Enthalpy of fusion
ΔfusH (kJ/mol) | Temperature (K) | Reference | Comment |
---|---|---|---|
22.52 | 371.8 | Acree, 1991 | AC |

References

Domanska, 1990
Domanska, U.,
Solubility of acetyl-substituted naphthols in binary solvent mixtures,
Fluid Phase Equilib., 1990, 55, 125-45. [all data]
Acree, 1991
Acree, William E.,
Thermodynamic properties of organic compounds: enthalpy of fusion and melting point temperature compilation,
Thermochimica Acta, 1991, 189, 1, 37-56, https://doi.org/10.1016/0040-6031(91)87098-H
. [all data]