3-ethyl-4-methyl-2-pentanone
- Formula: C8H16O
- Molecular weight: 128.2120
- IUPAC Standard InChIKey: KNCSWJHMGRXEDN-UHFFFAOYSA-N
- CAS Registry Number: 71172-57-1
- Chemical structure:
View 3d structure (requires JavaScript / HTML 5) - Permanent link for this species. Use this link for bookmarking this species for future reference.

Phase change data

Data compiled by: Thermodynamics Research Center, NIST Boulder Laboratories, Chris Muzny director
Quantity | Value | Units | Method | Reference | Comment |
---|---|---|---|---|---|
Tboil | 427. | K | N/A | Clarke, 1908 | Uncertainty assigned by TRC = 3. K |

References

Clarke, 1908
Clarke, L.,
Diethylisopropylmethane.,
Am. Chem. J., 1908, 39, 572. [all data]