Butyl heptyl ether
- Formula: C11H24O
- Molecular weight: 172.3077
- CAS Registry Number: 71112-90-8

Phase change data

Data compiled by: William E. Acree, Jr., James S. Chickos
Quantity | Value | Units | Method | Reference | Comment |
---|---|---|---|---|---|
ΔvapH° | 13.9 ± 0.02 | kcal/mol | C | Kusano, 1985 |

References

Kusano, 1985
Kusano, Kazuhito,
Micro conduction calorimeters to measure enthalpies of vaporization,
Thermochimica Acta, 1985, 88, 1, 109-120, https://doi.org/10.1016/0040-6031(85)85418-6
. [all data]