2H-Pyran-2-one, 6-hexyltetrahydro-
- Formula: C11H20O2
- Molecular weight: 184.2753
- IUPAC Standard InChIKey: YZRXRLLRSPQHDK-UHFFFAOYSA-N
- CAS Registry Number: 710-04-3
- Chemical structure:
View 3d structure (requires JavaScript / HTML 5) - Other names: δ-Hexylvalerolactone; δ-Hexyl-δ-valerolactone; δ-Undecalactone; 5-Hydroxyundecanoic acid lactone; 5-Hydroxy-n-undecanoic acid δ-lactone; 6-Hexyltetrahydro-2H-pyran-2-one; 2H-Pyran-2-one, tetrahydro-3-hexyl-; Undecanoic acid, 5-hydroxy-, δ-lactone; Undecanolide-1,5; δ-Undecanolide; Undecan-5-olide; 5-Undecanolide; β-Undecalactone; Undecanolactone

Condensed phase thermochemistry data

Data compiled by: Eugene S. Domalski and Elizabeth D. Hearing
Quantity | Value | Units | Method | Reference | Comment |
---|---|---|---|---|---|
S°liquid | 369.5 | J/mol*K | N/A | Lebedev, Yevstropov, et al., 1981 | |
S°liquid | 369.5 | J/mol*K | N/A | Lebedev, Yevstropov, et al., 1981, 2 |
Constant pressure heat capacity of liquid
Cp,liquid (J/mol*K) | Temperature (K) | Reference | Comment |
---|---|---|---|
342.7 | 298.15 | Lebedev, Yevstropov, et al., 1981 | T = 13.8 to 388 K. 0.92 mole % impurity in sample. |
342.7 | 298.15 | Lebedev, Yevstropov, et al., 1981, 2 | T = 13.8 to 388 K. 0.92 mole % impurity in sample. |

Phase change data

Data compiled as indicated in comments:
BS - Robert L. Brown and Stephen E. Stein
DH - Eugene S. Domalski and Elizabeth D. Hearing
Reduced pressure boiling point
Tboil (K) | Pressure (bar) | Reference | Comment |
---|---|---|---|
426.7 | 0.015 | Aldrich Chemical Company Inc., 1990 | BS |
Enthalpy of phase transition
ΔHtrs (kJ/mol) | Temperature (K) | Initial Phase | Final Phase | Reference | Comment |
---|---|---|---|---|---|
3.360 | 250.2 | crystaline, II | crystaline, I | Lebedev, Yevstropov, et al., 1981 | DH |
12.610 | 275.33 | crystaline, I | liquid | Lebedev, Yevstropov, et al., 1981 | DH |
3.360 | 250.2 | crystaline, II | crystaline, I | Lebedev, Yevstropov, et al., 1981, 2 | DH |
12.610 | 275.33 | crystaline, I | liquid | Lebedev, Yevstropov, et al., 1981, 2 | DH |
Entropy of phase transition
ΔStrs (J/mol*K) | Temperature (K) | Initial Phase | Final Phase | Reference | Comment |
---|---|---|---|---|---|
13.4 | 250.2 | crystaline, II | crystaline, I | Lebedev, Yevstropov, et al., 1981 | DH |
45.8 | 275.33 | crystaline, I | liquid | Lebedev, Yevstropov, et al., 1981 | DH |
13.4 | 250.2 | crystaline, II | crystaline, I | Lebedev, Yevstropov, et al., 1981, 2 | DH |
45.8 | 275.33 | crystaline, I | liquid | Lebedev, Yevstropov, et al., 1981, 2 | DH |

Van Den Dool and Kratz RI, polar column, temperature ramp

Column type | Active phase | I | Reference | Comment |
---|---|---|---|---|
Capillary | FFAP | 2264. | Lozano P.R., Miracle E.R., et al., 2007 | 30. m/0.25 mm/0.25 μm, He, 35. C @ 5. min, 10. K/min, 225. C @ 25. min |
Capillary | DB-Wax | 2345. | Mahajan, Goddik, et al., 2004 | 30. m/0.25 mm/0.5 μm, He, 40. C @ 2. min, 5. K/min, 230. C @ 10. min |
Capillary | DB-Wax | 2356. | Karagül-Yüceer, Cadwallader, et al., 2002 | 30. m/0.25 mm/0.25 μm, 35. C @ 5. min, 10. K/min, 200. C @ 30. min |
Capillary | DB-Wax | 2345. | Shimoda, Yoshimura, et al., 2001 | 60. m/0.25 mm/0.25 μm, He, 2. K/min, 230. C @ 60. min; Tstart: 50. C |
Capillary | DB-Wax | 2329. | Shiratsuchi, Shimoda, et al., 1994 | 60. m/0.25 mm/0.25 μm, He, 2. K/min, 230. C @ 60. min; Tstart: 50. C |

Normal alkane RI, non-polar column, temperature ramp

Column type | Active phase | I | Reference | Comment |
---|---|---|---|---|
Capillary | DB-1 | 1535. | Peppard, 1992 | 30. m/0.25 mm/1.0 μm, He, 3. K/min, 250. C @ 30. min; Tstart: 40. C |
Capillary | DB-1 | 1539. | Peppard, 1992 | 30. m/0.25 mm/1.0 μm, He, 3. K/min, 250. C @ 30. min; Tstart: 40. C |

Normal alkane RI, non-polar column, custom temperature program

Column type | Active phase | I | Reference | Comment |
---|---|---|---|---|
Capillary | SE-30 | 1579. | Vinogradov, 2004 | Program: not specified |

Normal alkane RI, polar column, temperature ramp

Column type | Active phase | I | Reference | Comment |
---|---|---|---|---|
Capillary | Supelcowax | 2336. | Näf and Velluz, 1998 | He, 5. K/min; Column length: 60. m; Column diameter: 0.25 mm; Tstart: 80. C; Tend: 240. C |

References

Lebedev, Yevstropov, et al., 1981
Lebedev, B.V.; Yevstropov, A.A.; Kiparisova, Ye.G.,
Thermodynamics of undecanolactone, tridecanolactone, and pentadecanolactone from 0 to 340 K,
J. Chem. Thermodyn., 1981, 13, 1185-1204. [all data]
Lebedev, Yevstropov, et al., 1981, 2
Lebedev, B.V.; Yevstropov, A.A.; Kiparisova, Y.G.,
Thermodynamic properties of undecanolactone over the range, 1981, Termodin. [all data]
Aldrich Chemical Company Inc., 1990
Aldrich Chemical Company Inc.,
Catalog Handbook of Fine Chemicals, Aldrich Chemical Company, Inc., Milwaukee WI, 1990, 1. [all data]
Lozano P.R., Miracle E.R., et al., 2007
Lozano P.R.; Miracle E.R.; Krause A.J.; Drake M.; Cadwallader K.R.,
Effect of cold storage and packaging material on the major aroma components of sweet cream butter,
J. Agric. Food Chem., 2007, 55, 19, 7840-7846, https://doi.org/10.1021/jf071075q
. [all data]
Mahajan, Goddik, et al., 2004
Mahajan, S.S.; Goddik, L.; Qian, M.C.,
Aroma Compounds in Sweet Whey Powder,
J. Dairy Sci., 2004, 87, 12, 4057-4063, https://doi.org/10.3168/jds.S0022-0302(04)73547-X
. [all data]
Karagül-Yüceer, Cadwallader, et al., 2002
Karagül-Yüceer, Y.; Cadwallader, K.R.; Drake, M.A.,
Volatile flavor components of stored nonfat dry milk,
J. Agric. Food Chem., 2002, 50, 2, 305-312, https://doi.org/10.1021/jf010648a
. [all data]
Shimoda, Yoshimura, et al., 2001
Shimoda, M.; Yoshimura, Y.; Yoshimura, T.; Noda, K.; Osajima, Y.,
Volatile flavor compounds of sweetened condensed milk,
J. Food Sci., 2001, 66, 6, 804-807, https://doi.org/10.1111/j.1365-2621.2001.tb15176.x
. [all data]
Shiratsuchi, Shimoda, et al., 1994
Shiratsuchi, H.; Shimoda, M.; Imayoshi, K.; Noda, K.; Osajima, Y.,
Volatile flavor compounds in spray-dried skim milk powder,
J. Agric. Food Chem., 1994, 42, 4, 984-988, https://doi.org/10.1021/jf00040a028
. [all data]
Peppard, 1992
Peppard, T.L.,
Volatile flavor constituents of Monstera deliciosa,
J. Agric. Food Chem., 1992, 40, 2, 257-262, https://doi.org/10.1021/jf00014a018
. [all data]
Vinogradov, 2004
Vinogradov, B.A.,
Production, composition, properties and application of essential oils, 2004, retrieved from http://viness.narod.ru. [all data]
Näf and Velluz, 1998
Näf, R.; Velluz, A.,
Phenols and lactones in Italo-Mitcham peppermint oil Mentha × piperita L.,
Flavour Fragr. J., 1998, 13, 3, 203-208, https://doi.org/10.1002/(SICI)1099-1026(199805/06)13:3<203::AID-FFJ725>3.0.CO;2-0
. [all data]