Hexatetracontane
- Formula: C46H94
- Molecular weight: 647.2386
- CAS Registry Number: 7098-24-0

Phase change data

Data compiled as indicated in comments:
TRC - Thermodynamics Research Center, NIST Boulder Laboratories, Chris Muzny director
AC - William E. Acree, Jr., James S. Chickos
Quantity | Value | Units | Method | Reference | Comment |
---|---|---|---|---|---|
Tfus | 361. | K | N/A | Geiger-Berschandy, 1955 | Uncertainty assigned by TRC = 4. K; TRC |
Tfus | 361. | K | N/A | Kirrmann and Berschandy, 1952 | Uncertainty assigned by TRC = 2. K; TRC |
Quantity | Value | Units | Method | Reference | Comment |
ΔvapH° | 233.3 | kJ/mol | CGC | Chickos, Wang, et al., 2008 | Based on data from 323. to 523. K.; AC |
Enthalpy of vaporization
ΔvapH (kJ/mol) | Temperature (K) | Method | Reference | Comment |
---|---|---|---|---|
142.8 | 601. | A,E | Stephenson and Malanowski, 1987 | Based on data from 586. to 832. K. See also Kudchadker and Zwolinski, 1966.; AC |
Enthalpy of fusion
ΔfusH (kJ/mol) | Temperature (K) | Reference | Comment |
---|---|---|---|
151.4 | 360.7 | Briard, Bouroukba, et al., 2003 | AC |

References

Geiger-Berschandy, 1955
Geiger-Berschandy, S.,
Bull. Soc. Chim. Fr., 1955, 1955, 994. [all data]
Kirrmann and Berschandy, 1952
Kirrmann, A.; Berschandy, S.,
Synthesis of Long-chain Alkyl Bromides,
C. R. Hebd. Seances Acad. Sci., 1952, 234, 1373. [all data]
Chickos, Wang, et al., 2008
Chickos, James; Wang, Tracy; Sharma, Esseim,
Hypothetical Thermodynamic Properties: Vapor Pressures and Vaporization Enthalpies of the Even n -Alkanes from C 40 to C 76 at T = 298.15 K by Correlation-Gas Chromatography. Are the Vaporization Enthalpies a Linear Function of Carbon Number?,
J. Chem. Eng. Data, 2008, 53, 2, 481-491, https://doi.org/10.1021/je7005852
. [all data]
Stephenson and Malanowski, 1987
Stephenson, Richard M.; Malanowski, Stanislaw,
Handbook of the Thermodynamics of Organic Compounds, 1987, https://doi.org/10.1007/978-94-009-3173-2
. [all data]
Kudchadker and Zwolinski, 1966
Kudchadker, A.P.; Zwolinski, B.J.,
Vapor Pressure and Boiling Points of Normal Alkanes, C 21 to C 100 .,
J. Chem. Eng. Data, 1966, 11, 2, 253-255, https://doi.org/10.1021/je60029a039
. [all data]
Briard, Bouroukba, et al., 2003
Briard, Anne-Julie; Bouroukba, Mohammed; Petitjean, Dominique; Hubert, Nathalie; Dirand, Michel,
Experimental Enthalpy Increments from the Solid Phases to the Liquid Phase of Homologous n -Alkane Series (C 18 to C 38 and C 41 , C 44 , C 46 , C 50 , C 54 , and C 60 ),
J. Chem. Eng. Data, 2003, 48, 3, 497-513, https://doi.org/10.1021/je0201368
. [all data]