1H-Imidazole, 1-ethyl-
- Formula: C5H8N2
- Molecular weight: 96.1304
- IUPAC Standard InChIKey: IWDFHWZHHOSSGR-UHFFFAOYSA-N
- CAS Registry Number: 7098-07-9
- Chemical structure:
View 3d structure (requires JavaScript / HTML 5) - Other names: Imidazole, 1-ethyl-; N-Ethylimidazole; 1-Ethylimidazole; 1-Ethyl-1H-imidazole

Phase change data

Data compiled by: William E. Acree, Jr., James S. Chickos
Quantity | Value | Units | Method | Reference | Comment |
---|---|---|---|---|---|
ΔvapH° | 15.8 ± 0.93 | kcal/mol | C | Ribeiro da Silva, 1999 |

Kovats' RI, non-polar column, isothermal

Column type | Active phase | Temperature (C) | I | Reference | Comment |
---|---|---|---|---|---|
Capillary | OV-101 | 110. | 991. | Golovnya, Kuz'menko, et al., 2000 | He; Phase thickness: 0.4 μm |
Capillary | OV-101 | 110. | 990. | Golovnya, Zhuravleva, et al., 1992 | 30. m/0.30 mm/0.20 μm |

Kovats' RI, polar column, isothermal

Column type | Active phase | Temperature (C) | I | Reference | Comment |
---|---|---|---|---|---|
Capillary | PEG-40M/KF | 170. | 1714. | Golovnya, Zhuravleva, et al., 1992 | 30. m/0.3 mm/0.2 μm |

References

Ribeiro da Silva, 1999
Ribeiro da Silva, M.,
Enthalpies of combustion, heat capacities, and enthalpies of vaporization of 1-ethylimidazole and 1-ethylpyrazole,
The Journal of Chemical Thermodynamics, 1999, 31, 1, 129-138, https://doi.org/10.1006/jcht.1998.0436
. [all data]
Golovnya, Kuz'menko, et al., 2000
Golovnya, R.V.; Kuz'menko, T.E.; Krikunova, N.I.,
The influence of alkyl substituents on the chromatographic indicator of self-association of N-containing heterocyclic compounds,
Russ. Chem. Bull. (Engl. Transl.), 2000, 49, 2, 321-324, https://doi.org/10.1007/BF02494681
. [all data]
Golovnya, Zhuravleva, et al., 1992
Golovnya, R.V.; Zhuravleva, I.L.; Sal'kova, M.A.,
Prediction of Retention Indexes of Alkylimadazoles Under Conditions of Capillary Gas Chromatography,
J. Anal. Chem. USSR (Engl. Transl.), 1992, 7, 932-937. [all data]