L-Threonine, N-glycyl-
- Formula: C6H12N2O4
- Molecular weight: 176.1705
- IUPAC Standard InChIKey: OLIFSFOFKGKIRH-WVZVXSGGSA-N
- CAS Registry Number: 7093-70-1
- Chemical structure:
View 3d structure (requires JavaScript / HTML 5) - Other names: N-glycyl-L-threonine

Reaction thermochemistry data

Data compiled by: Robert C. Dunbar
Individual Reactions
By formula: Na+ + C6H12N2O4 = (Na+ • C6H12N2O4)
Free energy of reaction
ΔrG° (kJ/mol) | T (K) | Method | Reference |
---|---|---|---|
162. | 0. | CIDC | Feng, Gronert, et al., 1999 |

Ion clustering data

Data compiled by: Robert C. Dunbar
Clustering reactions
By formula: Na+ + C6H12N2O4 = (Na+ • C6H12N2O4)
Free energy of reaction
ΔrG° (kJ/mol) | T (K) | Method | Reference |
---|---|---|---|
162. | 0. | CIDC | Feng, Gronert, et al., 1999 |

References

Feng, Gronert, et al., 1999
Feng, W.Y.; Gronert, S.; Lebrilla, C.B.,
Lithium and sodium ion binding energies of N-acetyl and N-glycyl amino acids,
J. Am. Chem. Soc., 1999, 121, 6, 1365, https://doi.org/10.1021/ja983116s
. [all data]