Benzene, 1,2-dimethoxy-4-nitro-
- Formula: C8H9NO4
- Molecular weight: 183.1614
- IUPAC Standard InChIKey: YFWBUVZWCBFSQN-UHFFFAOYSA-N
- CAS Registry Number: 709-09-1
- Chemical structure:
View 3d structure (requires JavaScript / HTML 5) - Other names: 3,4-Dimethoxynitrobenzene; 1,2-Dimethoxy-4-nitrobenzene; 4-Nitroveratrole; 4-Nitrcveratrole; 2-Methoxy-5-nitrophenol, methyl ether

Phase change data

Data compiled by: Robert L. Brown and Stephen E. Stein
Reduced pressure boiling point
Tboil (K) | Pressure (bar) | Reference |
---|---|---|
503.2 | 0.023 | Aldrich Chemical Company Inc., 1990 |

Van Den Dool and Kratz RI, non-polar column, custom temperature program

Column type | Active phase | I | Reference | Comment |
---|---|---|---|---|
Capillary | VF-5MS | 1624.1 | Tret'yakov, 2008 | 30. m/0.25 mm/0.25 μm, He; Program: Multi-step temperature program; T(initial)=60C; T(final)=270C |

References

Aldrich Chemical Company Inc., 1990
Aldrich Chemical Company Inc.,
Catalog Handbook of Fine Chemicals, Aldrich Chemical Company, Inc., Milwaukee WI, 1990, 1. [all data]
Tret'yakov, 2008
Tret'yakov, K.V.,
Retention Data. NIST Mass Spectrometry Data Center., NIST Mass Spectrometry Data Center, 2008. [all data]