α,α-dimethylbenzyl perbenzoate
- Formula: C16H16O3
- Molecular weight: 256.2964
- IUPAC Standard InChIKey: IXDKAJLKGJBFHD-UHFFFAOYSA-N
- CAS Registry Number: 7074-00-2
- Chemical structure:
View 3d structure (requires JavaScript / HTML 5) - Other names: Benzenecarboperoxoic acid, 1-methyl-1-phenylethyl ester

Gas phase thermochemistry data

Data compiled by: Hussein Y. Afeefy, Joel F. Liebman, and Stephen E. Stein
Quantity | Value | Units | Method | Reference | Comment |
---|---|---|---|---|---|
ΔfH°gas | -188. ± 14. | kJ/mol | Ccb | Kiparisova and Rabinovich, 1971 |

Condensed phase thermochemistry data

Data compiled by: Hussein Y. Afeefy, Joel F. Liebman, and Stephen E. Stein
Quantity | Value | Units | Method | Reference | Comment |
---|---|---|---|---|---|
ΔfH°solid | -231. ± 12. | kJ/mol | Ccb | Kiparisova and Rabinovich, 1971 | |
Quantity | Value | Units | Method | Reference | Comment |
ΔcH°solid | -8351. ± 12. | kJ/mol | Ccb | Kiparisova and Rabinovich, 1971 | Corresponding ΔfHºsolid = -231. kJ/mol (simple calculation by NIST; no Washburn corrections) |

Phase change data

Data compiled by: William E. Acree, Jr., James S. Chickos
Enthalpy of sublimation
ΔsubH (kJ/mol) | Temperature (K) | Method | Reference | Comment |
---|---|---|---|---|
43.1 ± 4.2 | 303. | ME | Kiparisova and Rabinovich, 1971, 2 | Based on data from 293. to 313. K. See also Pedley and Rylance, 1977. |

References

Kiparisova and Rabinovich, 1971
Kiparisova, E.G.; Rabinovich, I.B.,
Thermochemistry of a series of acyl peroxides,
Dokl. Phys. Chem. (Engl. Transl.), 1971, 199, 675-677, In original 1075. [all data]
Kiparisova and Rabinovich, 1971, 2
Kiparisova, E.G.; Rabinovich, I.B.,
Dokl. Akad. Nauk SSSR, 1971, 199, 5, 1075. [all data]
Pedley and Rylance, 1977
Pedley, J.B.; Rylance, J.,
, Computer Analysed Thermochemical Data: Organic and Organometallic Compounds, University of Sussex, Brighton, 1977. [all data]