Benzene, 1-bromo-2-(1-methylethyl)-
- Formula: C9H11Br
- Molecular weight: 199.088
- IUPAC Standard InChIKey: LECYCYNAEJDSIL-UHFFFAOYSA-N
- CAS Registry Number: 7073-94-1
- Chemical structure:
View 3d structure (requires JavaScript / HTML 5) - Other names: Cumene, o-bromo-; o-Bromocumene; o-Isopropylphenyl bromide; 1-Bromo-2-isopropylbenzene; 2-Bromoisopropylbenzene; 2-Isopropylbromobenzene

Phase change data

Data compiled as indicated in comments:
TRC - Thermodynamics Research Center, NIST Boulder Laboratories, Chris Muzny director
AC - William E. Acree, Jr., James S. Chickos
Quantity | Value | Units | Method | Reference | Comment |
---|---|---|---|---|---|
Tboil | 483.47 | K | N/A | Lamneck, 1954 | Uncertainty assigned by TRC = 0.3 K; TRC |
Quantity | Value | Units | Method | Reference | Comment |
Tfus | 214.25 | K | N/A | Lamneck, 1954 | Uncertainty assigned by TRC = 0.05 K; TRC |
Enthalpy of vaporization
ΔvapH (kJ/mol) | Temperature (K) | Method | Reference | Comment |
---|---|---|---|---|
48.4 | 419. | N/A | Dykyj, Svoboda, et al., 1999 | Based on data from 404. to 484. K.; AC |
49.8 | 393. | A | Stephenson and Malanowski, 1987 | Based on data from 378. to 528. K. See also Dykyj and Vanko, 1970.; AC |

Henry's Law data

Data compiled by: Rolf Sander
Henry's Law constant (water solution)
kH(T) = k°H exp(d(ln(kH))/d(1/T) ((1/T) - 1/(298.15 K)))
k°H = Henry's law constant for solubility in water at 298.15 K (mol/(kg*bar))
d(ln(kH))/d(1/T) = Temperature dependence constant (K)
k°H (mol/(kg*bar)) | d(ln(kH))/d(1/T) (K) | Method | Reference |
---|---|---|---|
0.17 | V | N/A |

References

Lamneck, 1954
Lamneck, J.H.,
Bromination of the two propylbenzenes and three butylbenzenes,
J. Am. Chem. Soc., 1954, 76, 1106. [all data]
Dykyj, Svoboda, et al., 1999
Dykyj, J.; Svoboda, J.; Wilhoit, R.C.; Frenkel, M.L.; Hall, K.R.,
Vapor Pressure of Chemicals: Part A. Vapor Pressure and Antoine Constants for Hydrocarbons and Sulfur, Selenium, Tellurium and Hydrogen Containing Organic Compounds, Springer, Berlin, 1999, 373. [all data]
Stephenson and Malanowski, 1987
Stephenson, Richard M.; Malanowski, Stanislaw,
Handbook of the Thermodynamics of Organic Compounds, 1987, https://doi.org/10.1007/978-94-009-3173-2
. [all data]
Dykyj and Vanko, 1970
Dykyj, J.; Vanko, A.,
Petrochemica, 1970, 10, 1, 3. [all data]