m-chlorocumene
- IUPAC Standard InChIKey: MCGSDKVOKTWDRB-UHFFFAOYSA-N
- CAS Registry Number: 7073-93-0
- Chemical structure:
View 3d structure (requires JavaScript / HTML 5) - Permanent link for this species. Use this link for bookmarking this species for future reference.

Reaction thermochemistry data

Data compiled by: Hussein Y. Afeefy, Joel F. Liebman, and Stephen E. Stein
Individual Reactions
By formula: C9H11Cl = m-chlorocumene
Quantity | Value | Units | Method | Reference | Comment |
---|---|---|---|---|---|
ΔrH° | -3.35 ± 0.84 | kJ/mol | Eqk | Nesterova, Rozhnov, et al., 1985 | liquid phase |

References

Nesterova, Rozhnov, et al., 1985
Nesterova, T.N.; Rozhnov, A.M.; Malova, T.N.; Kovzel, E.N.,
Molar enthalpies of formation of isopropylchlorobenzenes derived from equilibrium measurements,
J. Chem. Thermodyn., 1985, 17, 649-656. [all data]