1,5-Dioxaspiro[5.5]undecane, 3,3-dimethyl-
- Formula: C11H20O2
- Molecular weight: 184.2753
- IUPAC Standard InChIKey: QIFSGRPJUXQGMD-UHFFFAOYSA-N
- CAS Registry Number: 707-29-9
- Chemical structure:
View 3d structure (requires JavaScript / HTML 5) - Other names: Cyclohexanone, 2,2-dimethyl-1,3-propanediol ketal; 3,3-dimethyl-1,5-dioxaspiro[5.5]undecane

Phase change data

Data compiled by: William E. Acree, Jr., James S. Chickos
Enthalpy of vaporization
ΔvapH (kJ/mol) | Temperature (K) | Method | Reference | Comment |
---|---|---|---|---|
59.0 ± 0.6 | 283. to 323. | GS | Verevkin, Peng, et al., 1998 | See also Verevkin, 2002. |

References

Verevkin, Peng, et al., 1998
Verevkin, S.P.; Peng, W.-H.; Beckhaus, H.D.; Rücuardt, C.,
Geminal substituent effects. 16. Does the anomeric effect in ketals depend on the hybridization of the central carbon atom?,
Eur. J. Org. Chem., 1998, 11, 2323. [all data]
Verevkin, 2002
Verevkin, Sergey P.,
Improved Benson Increments for the Estimation of Standard Enthalpies of Formation and Enthalpies of Vaporization of Alkyl Ethers, Acetals, Ketals, and Ortho Esters,
J. Chem. Eng. Data, 2002, 47, 5, 1071-1097, https://doi.org/10.1021/je020023o
. [all data]