1-benzyl-4,5-bis(chloromethyl)-1H-1,2,3-triazole
- Formula: C11H11Cl2N3
- Molecular weight: 256.131
- IUPAC Standard InChIKey: GQFUESXIIRQKIK-UHFFFAOYSA-N
- CAS Registry Number: 70691-95-1
- Chemical structure:
View 3d structure (requires JavaScript / HTML 5) - Permanent link for this species. Use this link for bookmarking this species for future reference.

Phase change data

Data compiled by: Thermodynamics Research Center, NIST Boulder Laboratories, Chris Muzny director
Quantity | Value | Units | Method | Reference | Comment |
---|---|---|---|---|---|
Tfus | 229.07 | K | N/A | Moffat and Rutter, 1962 | Uncertainty assigned by TRC = 6.27 K |

References

Moffat and Rutter, 1962
Moffat, J.; Rutter, J.L.,
1-Benzyl-4,5-bis(chloromethyl)-1H-1,2,3-triazole,
J. Chem. Eng. Data, 1962, 7, 542. [all data]