Benzenesulfonamide, 4-methyl-
- Formula: C7H9NO2S
- Molecular weight: 171.217
- IUPAC Standard InChIKey: LMYRWZFENFIFIT-UHFFFAOYSA-N
- CAS Registry Number: 70-55-3
- Chemical structure:
View 3d structure (requires JavaScript / HTML 5) - Other names: p-Toluenesulfonamide; p-Methylbenzenesulfonamide; p-Toluenesulfamide; p-Toluenesulfonylamide; p-Tolylsulfonamide; p-Tosylamide; Toluene-p-sulfonamide; Toluene-4-sulfonamide; Tolylsulfonamide; Tosylamide; 4-Methylbenzenesulfonamide; para-Toluenesulfonamide; 4-Toluenesulfonamide; p-Toluenesulfanamide; 4-Toluenesulfanamide; Toluene-p-sulphonamide; p-Toluenesulphonamide; Uniplex 173; Tolouen-4-sulfonamide; NSC 9908; toluene-4-sulphonamide

Phase change data

Data compiled by: Thermodynamics Research Center, NIST Boulder Laboratories, Chris Muzny director
Quantity | Value | Units | Method | Reference | Comment |
---|---|---|---|---|---|
Tfus | 338.25 | K | N/A | Fort and Roberts, 1956 | Uncertainty assigned by TRC = 0.7 K |
Tfus | 339.25 | K | N/A | Fort and Roberts, 1956 | Uncertainty assigned by TRC = 0.5 K |

Reaction thermochemistry data

Data compiled by: John E. Bartmess
Individual Reactions
C7H8NO2S- + =
By formula: C7H8NO2S- + H+ = C7H9NO2S
Quantity | Value | Units | Method | Reference | Comment |
---|---|---|---|---|---|
ΔrG° | 1397. ± 8.4 | kJ/mol | IMRE | Koppel, Koppel, et al., 2001 | gas phase |

Gas phase ion energetics data

Data compiled by: John E. Bartmess
De-protonation reactions
C7H8NO2S- + =
By formula: C7H8NO2S- + H+ = C7H9NO2S
Quantity | Value | Units | Method | Reference | Comment |
---|---|---|---|---|---|
ΔrG° | 1397. ± 8.4 | kJ/mol | IMRE | Koppel, Koppel, et al., 2001 | gas phase |

Van Den Dool and Kratz RI, non-polar column, temperature ramp

Column type | Active phase | I | Reference | Comment |
---|---|---|---|---|
Capillary | VF-5MS | 1692. | Todua, 2011 | 30. m/0.25 mm/0.25 μm, He; Tstart: 60. C; Tend: 270. C |

References

Fort and Roberts, 1956
Fort, A.W.; Roberts, J.D.,
The Reactions of 3-Phenyl-1-propylamine-1-14C and 3-(p-methoxyphenyl)- propylamine-1-14C with Nitrous Acid,
J. Am. Chem. Soc., 1956, 78, 584. [all data]
Koppel, Koppel, et al., 2001
Koppel, I.A.; Koppel, J.; Leito, I.; Koppel, I.; Mishima, M.; Yagupolskii, L.M.,
The enormous acidifying effect of the supersubstituent =NSO2CF3 on the acidity of derivatives of benzenesulfonamide and toluene-p-sulfonamide in the gas phase and in dimethyl sulfoxide,
J. Chem. Soc. Perkin Trans., 2001, 2, 2, 229-232, https://doi.org/10.1039/b005765g
. [all data]
Lang (editor), 1972
Lang (editor), L.,
Absorption Spectra in the Ultraviolet and Visible Region, 1972, 16, 117. [all data]
Todua, 2011
Todua, N.G.,
Retention Data. NIST Mass Spectrometry Data Center., NIST Mass Spectrometry Data Center, 2011. [all data]