dl-Lysine
- Formula: C6H14N2O2
- Molecular weight: 146.1876
- IUPAC Standard InChIKey: KDXKERNSBIXSRK-UHFFFAOYSA-N
- CAS Registry Number: 70-54-2
- Chemical structure:

Condensed phase thermochemistry data

Data compiled by: Hussein Y. Afeefy, Joel F. Liebman, and Stephen E. Stein
Quantity | Value | Units | Method | Reference | Comment |
---|---|---|---|---|---|
ΔcH°solid | -3683.2 ± 1.5 | kJ/mol | Ccb | Ponomarev and Migarskaya, 1960 | Reanalyzed by Cox and Pilcher, 1970, Original value = -3684.7 ± 0.2 kJ/mol |

Ion clustering data

Data compiled by: Robert C. Dunbar
Clustering reactions
By formula: Na+ + C6H14N2O2 = (Na+ • C6H14N2O2)
Quantity | Value | Units | Method | Reference | Comment |
---|---|---|---|---|---|
ΔrH° | >213. | kJ/mol | CIDC | Kish, Ohanessian, et al., 2003 | Anchor alanine=39.89 |

Reaction thermochemistry data

Data compiled by: Robert C. Dunbar
Individual Reactions
By formula: Na+ + C6H14N2O2 = (Na+ • C6H14N2O2)
Quantity | Value | Units | Method | Reference | Comment |
---|---|---|---|---|---|
ΔrH° | >50.9 | kcal/mol | CIDC | Kish, Ohanessian, et al., 2003 | Anchor alanine=39.89 |

References

Ponomarev and Migarskaya, 1960
Ponomarev, V.V.; Migarskaya, L.B.,
Heats of combustion of some amino-acids,
Russ. J. Phys. Chem. (Engl. Transl.), 1960, 34, 1182-1183. [all data]
Cox and Pilcher, 1970
Cox, J.D.; Pilcher, G.,
Thermochemistry of Organic and Organometallic Compounds, Academic Press, New York, 1970, 1-636. [all data]
Kish, Ohanessian, et al., 2003
Kish, M.M.; Ohanessian, G.; Wesdemiotis, C.,
The Na+ affinities of a-amino acids: side-chain substituent effects,
Int. J. Mass Spectrom., 2003, 227, 3, 509, https://doi.org/10.1016/S1387-3806(03)00082-4
. [all data]