Ethanone, 1-(2-hydroxy-5-methoxyphenyl)-
- Formula: C9H10O3
- Molecular weight: 166.1739
- IUPAC Standard InChIKey: MLIBGOFSXXWRIY-UHFFFAOYSA-N
- CAS Registry Number: 705-15-7
- Chemical structure:
View 3d structure (requires JavaScript / HTML 5) - Other names: Acetophenone, 2'-hydroxy-5'-methoxy-; 2-Hydroxy-5-methoxyacetophenone; 2'-Hydroxy-5'-methoxyacetophenone; 5-Methoxy-2-hydroxyacetophenone; 1-(2-Hydroxy-5-methoxyphenyl)ethanone; 1-(2-hydroxy-5-methoxyphenyl)ethan-1-one

Van Den Dool and Kratz RI, non-polar column, custom temperature program

Column type | Active phase | I | Reference | Comment |
---|---|---|---|---|
Capillary | VF-5MS | 1422.3 | Tret'yakov, 2008 | 30. m/0.25 mm/0.25 μm, He; Program: Multi-step temperature program; T(initial)=60C; T(final)=270C |

Normal alkane RI, non-polar column, temperature ramp

Column type | Active phase | I | Reference | Comment |
---|---|---|---|---|
Capillary | CP-Sil 5 CB | 1416. | Mothana, Hasson, et al., 2011 | 30. m/0.25 mm/0.26 μm, Nitrogen, 3. K/min, 280. C @ 22. min; Tstart: 45. C |

References

Tret'yakov, 2008
Tret'yakov, K.V.,
Retention Data. NIST Mass Spectrometry Data Center., NIST Mass Spectrometry Data Center, 2008. [all data]
Mothana, Hasson, et al., 2011
Mothana, R.A.A.; Hasson, S.S.; Schultze, W.; Mowitz, A.; Lindequist, U.,
Phytochemical composition and in vitro antimicrobial and antioxidant activities of essential oils of three endemic Soqotraen Boswellia species,
Food Chem., 2011, 126, 3, 1149-1154, https://doi.org/10.1016/j.foodchem.2010.11.150
. [all data]