L-Asparagine
- Formula: C4H8N2O3
- Molecular weight: 132.1179
- IUPAC Standard InChIKey: DCXYFEDJOCDNAF-UWTATZPHSA-N
- CAS Registry Number: 70-47-3
- Chemical structure:
View 3d structure (requires JavaScript / HTML 5) - Other names: Asparagine, L-; (-)-Asparagine; Agedoite; Altheine; Asparagine; Butanoic acid, 2,4-diamino-4-oxo-, (S)-; L-β-Asparagine; (S)-2,4-Diamino-4-oxobutanoic acid; Asn; Asparamide; Aspartic acid β amide; (S)-Asparagine; Asparagine acid; Aspartamic acid; Crystal VI; L-2,4-Diamino-4-oxobutanoic acid; NSC 82391; α-Aminosuccinamic acid; Asparagine l(-)

Condensed phase thermochemistry data

Data compiled as indicated in comments:
ALS - Hussein Y. Afeefy, Joel F. Liebman, and Stephen E. Stein
DH - Eugene S. Domalski and Elizabeth D. Hearing
Quantity | Value | Units | Method | Reference | Comment |
---|---|---|---|---|---|
ΔfH°solid | -789.02 | kJ/mol | Ccb | Huffman, Ellis, et al., 1936 | ALS |
Quantity | Value | Units | Method | Reference | Comment |
ΔcH°solid | -1928.5 ± 0.71 | kJ/mol | Ccb | Huffman, Ellis, et al., 1936 | ALS |
Quantity | Value | Units | Method | Reference | Comment |
S°solid,1 bar | 174.5 | J/mol*K | N/A | Huffman and Borsook, 1932 | Extrapolation below 90 K, 49.79 J/mol*K.; DH |
Constant pressure heat capacity of solid
Cp,solid (J/mol*K) | Temperature (K) | Reference | Comment |
---|---|---|---|
159.8 | 296.5 | Huffman and Borsook, 1932 | T = 85 to 297 K. Value is unsmoothed experimental datum.; DH |

Reaction thermochemistry data

Data compiled as indicated in comments:
B - John E. Bartmess
RCD - Robert C. Dunbar
Individual Reactions
C4H7N2O3- + =
By formula: C4H7N2O3- + H+ = C4H8N2O3
Quantity | Value | Units | Method | Reference | Comment |
---|---|---|---|---|---|
ΔrH° | 1385. ± 9.2 | kJ/mol | CIDC | Jones, Bernier, et al., 2007 | gas phase; B |
ΔrH° | 1387. ± 13. | kJ/mol | G+TS | O'Hair, Bowie, et al., 1992 | gas phase; B |
Quantity | Value | Units | Method | Reference | Comment |
ΔrG° | 1356. ± 9.6 | kJ/mol | H-TS | Jones, Bernier, et al., 2007 | gas phase; B |
ΔrG° | 1359. ± 13. | kJ/mol | CIDC | O'Hair, Bowie, et al., 1992 | gas phase; B |
By formula: Na+ + C4H8N2O3 = (Na+ • C4H8N2O3)
Quantity | Value | Units | Method | Reference | Comment |
---|---|---|---|---|---|
ΔrH° | 206. | kJ/mol | CIDC | Kish, Ohanessian, et al., 2003 | Anchor alanine=39.89; RCD |

Gas phase ion energetics data

Data evaluated as indicated in comments:
HL - Edward P. Hunter and Sharon G. Lias
Data compiled as indicated in comments:
B - John E. Bartmess
MM - Michael M. Meot-Ner (Mautner)
Quantity | Value | Units | Method | Reference | Comment |
---|---|---|---|---|---|
Proton affinity (review) | 929. | kJ/mol | N/A | Hunter and Lias, 1998 | HL |
Quantity | Value | Units | Method | Reference | Comment |
Gas basicity | 891.5 | kJ/mol | N/A | Hunter and Lias, 1998 | HL |
Proton affinity at 298K
Proton affinity (kJ/mol) | Reference | Comment |
---|---|---|
965.2 ± 5.2 | Bouchoux, Buisson, et al., 2004 | MM |
937.6 | Bojesen and Breindahl, 1994 | PA increased by 2.0 kcal/mol for referencing values to Hunter and Lias, 1998; MM |
Gas basicity at 298K
Gas basicity (review) (kJ/mol) | Reference | Comment |
---|---|---|
920.0 ± 5.6 | Bouchoux, Buisson, et al., 2004 | MM |
Protonation entropy at 298K
Protonation entropy (J/mol*K) | Reference | Comment |
---|---|---|
-43. ± 7. | Bouchoux, Buisson, et al., 2004 | MM |
De-protonation reactions
C4H7N2O3- + =
By formula: C4H7N2O3- + H+ = C4H8N2O3
Quantity | Value | Units | Method | Reference | Comment |
---|---|---|---|---|---|
ΔrH° | 1385. ± 9.2 | kJ/mol | CIDC | Jones, Bernier, et al., 2007 | gas phase; B |
ΔrH° | 1387. ± 13. | kJ/mol | G+TS | O'Hair, Bowie, et al., 1992 | gas phase; B |
Quantity | Value | Units | Method | Reference | Comment |
ΔrG° | 1356. ± 9.6 | kJ/mol | H-TS | Jones, Bernier, et al., 2007 | gas phase; B |
ΔrG° | 1359. ± 13. | kJ/mol | CIDC | O'Hair, Bowie, et al., 1992 | gas phase; B |

Ion clustering data

Data compiled by: Robert C. Dunbar
Clustering reactions
By formula: Na+ + C4H8N2O3 = (Na+ • C4H8N2O3)
Quantity | Value | Units | Method | Reference | Comment |
---|---|---|---|---|---|
ΔrH° | 206. | kJ/mol | CIDC | Kish, Ohanessian, et al., 2003 | Anchor alanine=39.89 |

References

Huffman, Ellis, et al., 1936
Huffman, H.M.; Ellis, E.L.; Fox, S.W.,
Thermal data. VI. The heats of combustion and free energies of seven organic compounds containing nitrogen,
J. Am. Chem. Soc., 1936, 58, 1728-1733. [all data]
Huffman and Borsook, 1932
Huffman, H.M.; Borsook, H.,
Thermal data. I. The heat capacities, entropies and free energies of seven organic compounds containing nitrogen,
J. Am. Chem. Soc., 1932, 54, 4297-4301. [all data]
Jones, Bernier, et al., 2007
Jones, C.M.; Bernier, M.; Carson, E.; Colyer, K.E.; Metz, R.; Pawlow, A.; Wischow, E.D.; Webb, I.; Andriole, E.J.; Poutsma, J.C.,
Gas-phase Acities of the 20 Protein Amino Acids,
Int. J. Mass Spectrom., 2007, 267, 1-3, 54-62, https://doi.org/10.1016/j.ijms.2007.02.018
. [all data]
O'Hair, Bowie, et al., 1992
O'Hair, R.J.; Bowie, J.H.; Gronert, S.,
Gas Phase Acidity of the alpha-Amino Acids,
Int. J. Mass Spectrom. Ion Proc., 1992, 117, 23, https://doi.org/10.1016/0168-1176(92)80083-D
. [all data]
Kish, Ohanessian, et al., 2003
Kish, M.M.; Ohanessian, G.; Wesdemiotis, C.,
The Na+ affinities of a-amino acids: side-chain substituent effects,
Int. J. Mass Spectrom., 2003, 227, 3, 509, https://doi.org/10.1016/S1387-3806(03)00082-4
. [all data]
Hunter and Lias, 1998
Hunter, E.P.; Lias, S.G.,
Evaluated Gas Phase Basicities and Proton Affinities of Molecules: An Update,
J. Phys. Chem. Ref. Data, 1998, 27, 3, 413-656, https://doi.org/10.1063/1.556018
. [all data]
Bouchoux, Buisson, et al., 2004
Bouchoux, G.; Buisson, D.A.; Colas, C.; Sablier, M.,
Protonation thermochemistry of alpha-amino acids bearing a basic residue,
European J. Mass Spectrom., 2004, 10, 977. [all data]
Bojesen and Breindahl, 1994
Bojesen, G.; Breindahl, T.,
On the Proton Affinity od Some Alpha-Amino Acids and the Theory of the Kinetic Method.,
J. Chem. Soc. Perkin 2, 1994, 1029. [all data]
Saidel and Waldman, 1952
Saidel, L.J.; Waldman, S.,
J. Biol. Chem., 1952, 197, 285. [all data]