3-Nitraza-1,5-pentanediisocyanate
- Formula: C6H8N4O4
- Molecular weight: 200.1521
- IUPAC Standard InChIKey: PMZAXZNFRDOMGE-UHFFFAOYSA-N
- CAS Registry Number: 7046-61-9
- Chemical structure:
View 3d structure (requires JavaScript / HTML 5) - Permanent link for this species. Use this link for bookmarking this species for future reference.

Condensed phase thermochemistry data

Data compiled by: Hussein Y. Afeefy, Joel F. Liebman, and Stephen E. Stein
Quantity | Value | Units | Method | Reference | Comment |
---|---|---|---|---|---|
ΔfH°solid | -142.1 ± 2.9 | kJ/mol | Ccb | Baroody and Peters, 1987 | |
Quantity | Value | Units | Method | Reference | Comment |
ΔcH°solid | -3242.35 | kJ/mol | Ccb | Handrick, 1956 |

References

Baroody and Peters, 1987
Baroody, E.E.; Peters, S.T.,
Heats of formation of propellant compounds (U), Rpt. IHSP-87-252 by Naval Ordnance Station, Indian Head, MD, 1987, 1-7. [all data]
Handrick, 1956
Handrick, G.R.,
Report of the study of pure explosive compounds. Part IV. Calculation of heat of combustion of organic compounds from structural features and calculation of power of high explosives, Rpt. C-58247 for the Office of the Chief of Ordnance, contract DA-19-020-ORD-47 by the Arthur D. Little, Inc., Cambridge, MA, 1956, 467-573. [all data]