(S)-(-)-2-methyl-1,4-butanediol
- Formula: C5H12O2
- Molecular weight: 104.1476
- IUPAC Standard InChIKey: MWCBGWLCXSUTHK-RXMQYKEDSA-N
- CAS Registry Number: 70423-38-0
- Chemical structure:
View 3d structure (requires JavaScript / HTML 5) - Stereoisomers:

Phase change data

Data compiled by: Thermodynamics Research Center, NIST Boulder Laboratories, Chris Muzny director
Quantity | Value | Units | Method | Reference | Comment |
---|---|---|---|---|---|
Tboil | 364.15 | K | N/A | Katsura, 1961 | Uncertainty assigned by TRC = 4. K |

References

Katsura, 1961
Katsura, H.,
Nippon Kagaku Zasshi, 1961, 82, 91. [all data]