CAS Reg. No. 70377-22-9
- CAS Registry Number: 70377-22-9

Reaction thermochemistry data

Data compiled by: John E. Bartmess
Individual Reactions
(CAS Reg. No. 70377-22-9 • 4294967295) +
= CAS Reg. No. 70377-22-9
By formula: (CAS Reg. No. 70377-22-9 • 4294967295Na) + Na = CAS Reg. No. 70377-22-9
Quantity | Value | Units | Method | Reference | Comment |
---|---|---|---|---|---|
ΔrH° | 114. ± 8.4 | kJ/mol | N/A | Miller, Leopold, et al., 1986 | gas phase |

References

Miller, Leopold, et al., 1986
Miller, T.M.; Leopold, D.G.; Murray, K.K.; Lineberger, W.C.,
Electron Affinities of the Alkali Halides and the Structure of their Negative Ions,
J. Chem. Phys., 1986, 85, 5, 2368, https://doi.org/10.1063/1.451091
. [all data]