Benzene, 1-fluoro-2,4-dinitro-
- Formula: C6H3FN2O4
- Molecular weight: 186.0974
- IUPAC Standard InChIKey: LOTKRQAVGJMPNV-UHFFFAOYSA-N
- CAS Registry Number: 70-34-8
- Chemical structure:

Phase change data

Data compiled by: Robert L. Brown and Stephen E. Stein
Reduced pressure boiling point
Tboil (K) | Pressure (atm) | Reference |
---|---|---|
451.2 | 0.033 | Weast and Grasselli, 1989 |

References

Weast and Grasselli, 1989
CRC Handbook of Data on Organic Compounds, 2nd Editon, Weast,R.C and Grasselli, J.G., ed(s)., CRC Press, Inc., Boca Raton, FL, 1989, 1. [all data]