Bicyclo[2.2.2]octane-1-carboxylic acid, 4-methyl-
- Formula: C10H16O2
- Molecular weight: 168.2328
- IUPAC Standard InChIKey: VAIOYMYTWWCODC-UHFFFAOYSA-N
- CAS Registry Number: 702-67-0
- Chemical structure:
View 3d structure (requires JavaScript / HTML 5) - Other names: 4-Methylbicyclo[2.2.2]octane-1-carboxylic acid

Reaction thermochemistry data

Data compiled by: John E. Bartmess
Individual Reactions
C10H15O2- + =
By formula: C10H15O2- + H+ = C10H16O2
Quantity | Value | Units | Method | Reference | Comment |
---|---|---|---|---|---|
ΔrH° | 1436. ± 9.2 | kJ/mol | G+TS | Taft and Topsom, 1987 | gas phase; value altered from reference due to change in acidity scale |
Quantity | Value | Units | Method | Reference | Comment |
ΔrG° | 1407. ± 8.4 | kJ/mol | IMRE | Taft and Topsom, 1987 | gas phase; value altered from reference due to change in acidity scale |

Gas phase ion energetics data

Data compiled by: John E. Bartmess
De-protonation reactions
C10H15O2- + =
By formula: C10H15O2- + H+ = C10H16O2
Quantity | Value | Units | Method | Reference | Comment |
---|---|---|---|---|---|
ΔrH° | 1436. ± 9.2 | kJ/mol | G+TS | Taft and Topsom, 1987 | gas phase; value altered from reference due to change in acidity scale |
Quantity | Value | Units | Method | Reference | Comment |
ΔrG° | 1407. ± 8.4 | kJ/mol | IMRE | Taft and Topsom, 1987 | gas phase; value altered from reference due to change in acidity scale |

References

Taft and Topsom, 1987
Taft, R.W.; Topsom, R.D.,
The Nature and Analysis of Substituent Effects,
Prog. Phys. Org. Chem., 1987, 16, 1. [all data]