(R)-3-methyl-1-pentanol
- Formula: C6H14O
- Molecular weight: 102.1748
- IUPAC Standard InChIKey: IWTBVKIGCDZRPL-LURJTMIESA-N
- CAS Registry Number: 70224-28-1
- Chemical structure:
View 3d structure (requires JavaScript / HTML 5) - Stereoisomers:

Phase change data

Data compiled by: Thermodynamics Research Center, NIST Boulder Laboratories, Chris Muzny director
Quantity | Value | Units | Method | Reference | Comment |
---|---|---|---|---|---|
Tboil | 424.65 | K | N/A | Bailey and Yates, 1961 | Uncertainty assigned by TRC = 2. K |
Tboil | 425.65 | K | N/A | Lardicci and Pino, 1961 | Uncertainty assigned by TRC = 2. K |

References

Bailey and Yates, 1961
Bailey, W.J.; Yates, E.T.,
J. Org. Chem., 1961, 26, 3193. [all data]
Lardicci and Pino, 1961
Lardicci; Pino,
Gazz. Chim. Ital., 1961, 91, 441. [all data]