N-Ethylidene t-butylamine

Phase change data

Data compiled by: Robert L. Brown and Stephen E. Stein

Quantity Value Units Method Reference Comment
Tboil354. - 355.KN/AFrinton Laboratories Inc., 1986

Reaction thermochemistry data

Data compiled by: Hussein Y. Afeefy, Joel F. Liebman, and Stephen E. Stein

Individual Reactions

Hydrogen + N-Ethylidene t-butylamine = N-tert-Butylethylamine

By formula: H2 + C6H13N = C6H15N

Quantity Value Units Method Reference Comment
Δr23.0 ± 1.4kcal/molChydHafelinger and Steinmann, 1977liquid phase; solvent: Acetic acid

References

Frinton Laboratories Inc., 1986
Frinton Laboratories Inc., Catalog Number 11, Frinton Laboratories Inc., Vineland, NJ, 1986, 99. [all data]