3,3,3-Trimethoxypropionitrile
- Formula: C6H11NO3
- Molecular weight: 145.1564
- IUPAC Standard InChIKey: IPJDXQYLAATRJK-UHFFFAOYSA-N
- CAS Registry Number: 70138-31-7
- Chemical structure:
View 3d structure (requires JavaScript / HTML 5) - Permanent link for this species. Use this link for bookmarking this species for future reference.

Phase change data

Data compiled by: Hussein Y. Afeefy, Joel F. Liebman, and Stephen E. Stein
Quantity | Value | Units | Method | Reference | Comment |
---|---|---|---|---|---|
ΔvapH° | 55.9 ± 4.2 | kJ/mol | E | Guthrie and Cullimore, 1980 |

Reaction thermochemistry data

Data compiled by: Hussein Y. Afeefy, Joel F. Liebman, and Stephen E. Stein
Individual Reactions
By formula: C6H11NO3 + H2O = C4H5NO2 + 2CH4O
Quantity | Value | Units | Method | Reference | Comment |
---|---|---|---|---|---|
ΔrH° | -25.7 ± 1.5 | kJ/mol | Eqk | Guthrie and Cullimore, 1980 | liquid phase |

References

Guthrie and Cullimore, 1980
Guthrie, J.P.; Cullimore, P.A.,
Effect of the acyl substituent on the equilibrium constant for hydration of esters,
Can. J. Chem., 1980, 58, 1281-1294. [all data]