1,1'-Biphenyl, 2,4,4'-trichloro-
- Formula: C12H7Cl3
- Molecular weight: 257.543
- IUPAC Standard InChIKey: BZTYNSQSZHARAZ-UHFFFAOYSA-N
- CAS Registry Number: 7012-37-5
- Chemical structure:
View 3d structure (requires JavaScript / HTML 5) - Other names: 2,4,4'-Trichlorobiphenyl; 2,4,4'-Trichloro-1,1'-biphenyl; PCB 28; Biphenyl, 2,4,4'-trichloro-

Phase change data

Data compiled by: William E. Acree, Jr., James S. Chickos
Enthalpy of sublimation
ΔsubH (kJ/mol) | Temperature (K) | Method | Reference | Comment |
---|---|---|---|---|
96.7 ± 3.4 | 320. | ME | Nakajoh, Shibata, et al., 2005 | Based on data from 313. to 328. K. |

Kovats' RI, non-polar column, isothermal

Column type | Active phase | Temperature (C) | I | Reference | Comment |
---|---|---|---|---|---|
Packed | OV-101 | 200. | 1857. | Albro, Haseman, et al., 1977 | Chromosorb W HP (80-100 mesh); Column length: 3. m |
Capillary | OV-101 | 180. | 1841.8 | Krupcik, Leclercq, et al., 1976 | Column length: 50. m |
Capillary | OV-101 | 190. | 1851.8 | Krupcik, Leclercq, et al., 1976 | Column length: 50. m |
Capillary | OV-101 | 200. | 1861.0 | Krupcik, Leclercq, et al., 1976 | Column length: 50. m |
Capillary | OV-101 | 200. | 1861.1 | Krupcik, Leclercq, et al., 1976 | Column length: 50. m |

Van Den Dool and Kratz RI, non-polar column, temperature ramp

Column type | Active phase | I | Reference | Comment |
---|---|---|---|---|
Capillary | DB-5 | 1840.1 | Castello and Testini, 1996 | 1. K/min; Column length: 30. m; Column diameter: 0.32 mm; Tstart: 100. C; Tend: 240. C |
Capillary | Methyl Silicone | 1831. | Kozloski, 1985 | He, 5. K/min; Column length: 10. m; Column diameter: 0.21 mm; Tstart: 60. C; Tend: 210. C |

Normal alkane RI, non-polar column, temperature ramp

Column type | Active phase | I | Reference | Comment |
---|---|---|---|---|
Capillary | HP-5 | 1881. | Zenkevich, Moeder, et al., 2004 | 30. m/0.25 mm/0.25 μm, Helium, 50. C @ 3. min, 3. K/min, 280. C @ 20. min |
Capillary | SPB-1 | 1819. | Nakano, Tsuji, et al., 1987 | 30. m/0.25 mm/0.25 μm, 4. K/min; Tstart: 130. C; Tend: 280. C |

Normal alkane RI, non-polar column, custom temperature program

Column type | Active phase | I | Reference | Comment |
---|---|---|---|---|
Capillary | Apolane | 1875. | Bush, Murphy, et al., 1985 | He; Column length: 50. m; Column diameter: 0.25 mm; Program: 70 0C (2 min) 10 0C/min (6 min) 2 0C/min -> 250 0C |
Capillary | Apolane | 1877. | Bush, Murphy, et al., 1985 | He; Column length: 50. m; Column diameter: 0.25 mm; Program: 70 0C (2 min) 10 0C/min (6 min) 2 0C/min -> 250 0C |
Capillary | OV-1, SE-30, Methyl silicone, SP-2100, OV-101, DB-1, etc. | 1818. | Waggott and Davies, 1984 | Hydrogen; Column length: 50. m; Column diameter: 0.32 mm; Program: not specified |

References

Nakajoh, Shibata, et al., 2005
Nakajoh, Katsuhiko; Shibata, Etsuro; Todoroki, Tomohiro; Ohara, Atsushi; Nishizawa, Katsushi; Nakamura, Takashi,
VAPOR PRESSURE OF TEN POLYCHLORINATED BIPHENYL CONGENERS AND TWO COMMERCIAL FLUIDS AS A FUNCTION OF TEMPERATURE,
Environ Toxicol Chem, 2005, 24, 7, 1602, https://doi.org/10.1897/04-381R.1
. [all data]
Albro, Haseman, et al., 1977
Albro, P.W.; Haseman, J.K.; Clemmer, T.A.; Corbett, B.J.,
Identification of the Individual Polychlorinated Biphenyls in a Mixture by Gas-Liquid Chromatography,
J. Chromatogr., 1977, 136, 1, 147-153, https://doi.org/10.1016/S0021-9673(00)83003-4
. [all data]
Krupcik, Leclercq, et al., 1976
Krupcik, J.; Leclercq, P.A.; Símová, A.; Suchánek, P.; Collák, M.; Hrivnák, J.,
Possibilities and limitations of capillary gas chromatography and mass spectrometry in the analysis of polychlorinated biphenyls,
J. Chromatogr., 1976, 119, 271-283, https://doi.org/10.1016/S0021-9673(00)86791-6
. [all data]
Castello and Testini, 1996
Castello, G.; Testini, G.,
Determination of retention indices of polychlorobiphenyls by using other compounds detectable by electron-capture detection or selected polychlorobiphenyls as the reference series,
J. Chromatogr. A, 1996, 741, 2, 241-249, https://doi.org/10.1016/0021-9673(96)00160-4
. [all data]
Kozloski, 1985
Kozloski, R.P.,
Polychlorinated biphenyl retention time standards obtained by chemical dechlorination of polychlorinated biphenyl isomers,
J. Chromatogr., 1985, 318, 211-219, https://doi.org/10.1016/S0021-9673(01)90682-X
. [all data]
Zenkevich, Moeder, et al., 2004
Zenkevich, I.G.; Moeder, M.; Koeller, G.; Schrader, S.,
Using new structurally related additive schemes in the precalculation of gas chromatographic retention indices of polychlorinated hydroxybiphenyls on HP-5 stationary phase,
J. Chromatogr. A, 2004, 1025, 2, 227-236, https://doi.org/10.1016/j.chroma.2003.10.106
. [all data]
Nakano, Tsuji, et al., 1987
Nakano, T.; Tsuji, M.; Okuno, T.,
Analytical methods for PCB using GC/ECD and GC/MS with capillary column,
Report of the Environmental Science Institute of Hyoho Prefecture, 1987, 19, 57-62. [all data]
Bush, Murphy, et al., 1985
Bush, B.; Murphy, M.J.; Connor, S.; Snow, J.; Barnard, E.,
Improvements in Glass Capillary Gas Chromatographic Polychlorobiphenyl Analysis,
J. Chromatogr. Sci., 1985, 23, 11, 509-515, https://doi.org/10.1093/chromsci/23.11.509
. [all data]
Waggott and Davies, 1984
Waggott, A.; Davies, I.W.,
Identification of organic pollutants using linear temperature programmed retention indices (LTPRIs) - Part II, 1984, retrieved from http://dwi.defra.gov.uk/research/completed-research/reports/dwi0383.pdf. [all data]