Co3 radical

Gas phase ion energetics data

Data compiled by: John E. Bartmess

Electron affinity determinations

EA (eV) Method Reference Comment
1.600 ± 0.050LPESLiu, Zhai, et al., 2001

References

Liu, Zhai, et al., 2001
Liu, S.R.; Zhai, H.J.; Wang, L.S., Electronic and structural evolution of Co-n clusters (n=1-108) by photoelectron spectroscopy - art. no. 153402, Phys. Rev. B: Cond. Matt., 2001, 64, 15, 3402, https://doi.org/10.1103/PhysRevB.64.153402 . [all data]