5-Methyl-2-nitrophenol
- Formula: C7H7NO3
- Molecular weight: 153.1354
- IUPAC Standard InChIKey: NQXUSSVLFOBRSE-UHFFFAOYSA-N
- CAS Registry Number: 700-38-9
- Chemical structure:
View 3d structure (requires JavaScript / HTML 5) - Other names: 3-Methyl-6-nitrophenol; Phenol, 5-methyl-2-nitro-; 6-Nitro-m-cresol; 3-Hydroxy-4-nitrotoluene; 5-Methyl-2-nitrophenol (3-6); 2-Nitro-5-methylphenol

Phase change data

Data compiled as indicated in comments:
TRC - Thermodynamics Research Center, NIST Boulder Laboratories, Chris Muzny director
AC - William E. Acree, Jr., James S. Chickos
Quantity | Value | Units | Method | Reference | Comment |
---|---|---|---|---|---|
Tfus | 327.8 | K | N/A | Buchowski, Domanska, et al., 1975 | Uncertainty assigned by TRC = 0.1 K; TRC |
Quantity | Value | Units | Method | Reference | Comment |
ΔvapH° | 15.0 ± 0.1 | kcal/mol | GS | Heintz, Kapteina, et al., 2007 | Based on data from 331. to 358. K.; AC |
Enthalpy of fusion
ΔfusH (kcal/mol) | Temperature (K) | Reference | Comment |
---|---|---|---|
4.969 | 302.8 | Acree, 1991 | AC |

Kovats' RI, non-polar column, custom temperature program

Column type | Active phase | I | Reference | Comment |
---|---|---|---|---|
Capillary | HP-5 | 1247. | Van Durme, Dewulf, et al., 2007 | Program: not specified |
Capillary | HP-5 | 1247.4 | Van Durme, Dewulf, et al., 2007 | Program: not specified |

References

Buchowski, Domanska, et al., 1975
Buchowski, H.; Domanska, U.; Ksiazczak, A.; Maczynski, A.,
Solubility and Hydrogen Bonding. Part II. Solubility of 2-Nitro-5- Methylphenol in One-Component Solvents,
Rocz. Chem., 1975, 49, 1889-1895. [all data]
Heintz, Kapteina, et al., 2007
Heintz, A.; Kapteina, S.; Verevkin, S.P.,
Pairwise-Substitution Effects and Intramolecular Hydrogen Bonds in Nitrophenols and Methylnitrophenols. Thermochemical Measurements and ab Initio Calculations,
J. Phys. Chem. A, 2007, 111, 28, 6552-6562, https://doi.org/10.1021/jp0730388
. [all data]
Acree, 1991
Acree, William E.,
Thermodynamic properties of organic compounds: enthalpy of fusion and melting point temperature compilation,
Thermochimica Acta, 1991, 189, 1, 37-56, https://doi.org/10.1016/0040-6031(91)87098-H
. [all data]
Van Durme, Dewulf, et al., 2007
Van Durme, J.; Dewulf, J.; Sysmans, W.; Leys, C.; Van Langenhove, H.,
Abatement and degradation pathways of toluene in indoor air by positive corona discharge,
Chemosphere, 2007, 68, 10, 1821-1829, https://doi.org/10.1016/j.chemosphere.2007.03.053
. [all data]