2,3,3-trimethyl-1-hexene
- Formula: C9H18
- Molecular weight: 126.2392
- CAS Registry Number: 700000-97-1

Phase change data

Data compiled by: Thermodynamics Research Center, NIST Boulder Laboratories, Chris Muzny director
Quantity | Value | Units | Method | Reference | Comment |
---|---|---|---|---|---|
Tboil | 404.9 | K | N/A | Cline, 1940 | Uncertainty assigned by TRC = 0.6 K |
Quantity | Value | Units | Method | Reference | Comment |
Tfus | 173.6 | K | N/A | Cline, 1939 | Uncertainty assigned by TRC = 2. K |

References

Cline, 1940
Cline, E.T.,
, PhD Thesis, 1940. [all data]
Cline, 1939
Cline, E.T.,
The Synthesis of Type III and Type V Olefins from Dimethylbutadien- monohydrobromide, Ph.D. Dissertation, Ohio State Univ., Columbus, OH, 1939. [all data]