Acetic acid dimer
- Formula: C4H8O4
- Molecular weight: 120.1039
- CAS Registry Number: 6993-75-5

Phase change data

Data compiled by: William E. Acree, Jr., James S. Chickos
Enthalpy of sublimation
ΔsubH (kcal/mol) | Temperature (K) | Method | Reference | Comment |
---|---|---|---|---|
16.8 ± 0.2 | 213. | TE | Calis-Van Ginkel, Calis, et al., 1978 | Based on data from 213. to 230. K. |
16.5 ± 0.2 | 213. | ME | Calis-Van Ginkel, Calis, et al., 1978 | Based on data from 213. to 230. K. |

Gas phase ion energetics data

Data compiled as indicated in comments:
LLK - Sharon G. Lias, Rhoda D. Levin, and Sherif A. Kafafi

Ionization energy determinations

IE (eV) Method Reference Comment
10.6PEThomas, 1972Vertical value; LLK

References

Calis-Van Ginkel, Calis, et al., 1978
Calis-Van Ginkel, C.H.D.; Calis, G.H.M.; Timmermans, C.W.M.; de Kruif, C.G.; Oonk, H.A.J.,
Enthalpies of sublimation and dimerization in the vapour phase of formic, acetic, propanoic, and butanoic acids,
The Journal of Chemical Thermodynamics, 1978, 10, 11, 1083-1088, https://doi.org/10.1016/0021-9614(78)90082-4
. [all data]