2-Phenylglycine
- Formula: C8H9NO2
- Molecular weight: 151.1626
- IUPAC Standard InChIKey: ZGUNAGUHMKGQNY-UHFFFAOYSA-N
- CAS Registry Number: 69-91-0
- Chemical structure:
View 3d structure (requires JavaScript / HTML 5) - Species with the same structure:
- Stereoisomers:
- Other names: Benzeneacetic acid, α-amino-, (.+/-.)-; (.+/-.)-α-Phenylglycine; DL-α-Aminophenylacetic acid; DL-α-Phenylglycine; DL-Phenylglycine; DL-2-Phenylglycine; Glycine, 2-phenyl-, DL-; 2-Amino-2-phenylacetic acid; Benzeneacetic acid, alpha-amino-; NSC 24619; NSC 32070; α-Aminobenzeneacetic ac; α-Aminophenylacetic acid; α-Phenylgycine; Benzeneacetic acid, α-amino-

Gas phase thermochemistry data

Data compiled by: Hussein Y. Afeefy, Joel F. Liebman, and Stephen E. Stein
Quantity | Value | Units | Method | Reference | Comment |
---|---|---|---|---|---|
ΔfH°gas | -280.5 ± 6.0 | kJ/mol | Ccr | Sabbah and Skoulika, 1980 |

Condensed phase thermochemistry data

Data compiled by: Hussein Y. Afeefy, Joel F. Liebman, and Stephen E. Stein
Quantity | Value | Units | Method | Reference | Comment |
---|---|---|---|---|---|
ΔfH°solid | -445.5 ± 0.63 | kJ/mol | Ccr | Sabbah and Skoulika, 1980 | |
Quantity | Value | Units | Method | Reference | Comment |
ΔcH°solid | -3988.79 ± 0.35 | kJ/mol | Ccr | Sabbah and Skoulika, 1980 | |
ΔcH°solid | -4010.9 | kJ/mol | Ccb | Lemoult, 1904 |

Phase change data

Data compiled by: Hussein Y. Afeefy, Joel F. Liebman, and Stephen E. Stein
Quantity | Value | Units | Method | Reference | Comment |
---|---|---|---|---|---|
ΔsubH° | 165. ± 6. | kJ/mol | C | Sabbah and Skoulika, 1980 |

References

Sabbah and Skoulika, 1980
Sabbah, R.; Skoulika, S.,
Thermodynamique de composes azotes. Partie VI. Etude thermochimique de la N-phenylglycine et de la D-α-phenylglycine,
Thermochim. Acta, 1980, 36, 179-187. [all data]
Lemoult, 1904
Lemoult, M.P.,
Remarques sur une serie recenie de determinations calorimetriques,
Compt. Rend., 1904, 663-635. [all data]