4,5-Tetramethylene-1,3-dithiol-2-thione
- Formula: C7H8S3
- Molecular weight: 188.333
- IUPAC Standard InChIKey: VEYQXNYJEOCIAT-UHFFFAOYSA-N
- CAS Registry Number: 698-42-0
- Chemical structure:
View 3d structure (requires JavaScript / HTML 5) - Permanent link for this species. Use this link for bookmarking this species for future reference.

Gas phase thermochemistry data

Data compiled by: Hussein Y. Afeefy, Joel F. Liebman, and Stephen E. Stein
Quantity | Value | Units | Method | Reference | Comment |
---|---|---|---|---|---|
ΔfH°gas | 29.54 | kcal/mol | Ccr | Geiseler, Schaffernicht, et al., 1967 |

Condensed phase thermochemistry data

Data compiled by: Hussein Y. Afeefy, Joel F. Liebman, and Stephen E. Stein
Quantity | Value | Units | Method | Reference | Comment |
---|---|---|---|---|---|
ΔcH°solid | -1368.6 ± 0.3 | kcal/mol | Ccr | Geiseler, Schaffernicht, et al., 1967 |

Phase change data

Data compiled as indicated in comments:
ALS - Hussein Y. Afeefy, Joel F. Liebman, and Stephen E. Stein
AC - William E. Acree, Jr., James S. Chickos
Quantity | Value | Units | Method | Reference | Comment |
---|---|---|---|---|---|
ΔsubH° | 24.4 ± 0.7 | kcal/mol | V | Geiseler, Schaffernicht, et al., 1967 | ALS |
Enthalpy of sublimation
ΔsubH (kcal/mol) | Temperature (K) | Reference | Comment |
---|---|---|---|
23.5 | 346. | Geiseler, Schaffernicht, et al., 1967 | Based on data from 340. to 352. K. See also Cox and Pilcher, 1970.; AC |

References

Geiseler, Schaffernicht, et al., 1967
Geiseler, V.G.; Schaffernicht, H.; Walther, H.J.,
Bildungsenthalpien und Mesomerieenergien von π-Bindungssystemen,
Ber. Bunsen-Ges. Phys. Chem., 1967, 71, 196-199. [all data]
Cox and Pilcher, 1970
Cox, J.D.; Pilcher, G.,
Thermochemistry of Organic and Organometallic Compounds, Academic Press Inc., London, 1970, 643. [all data]