Maltose
- Formula: C12H22O11
- Molecular weight: 342.2965
- IUPAC Standard InChIKey: GUBGYTABKSRVRQ-GXGLMDGZSA-N
- CAS Registry Number: 69-79-4
- Chemical structure:
- Other names: D-Glucose, 4-O-α-D-glucopyranosyl-; D-Maltose; Malt sugar; Maltobiose; Cextromaltose; 4-(α-D-Glucopyranosido)-α-glucopyranose; 4-(α-D-Glucosido)-D-glucose; α-Malt sugar; 4-O-α-d-Glucopyranosyl-d-glucose; Maltos; Martos-10; Advantose 100; D-(+)-Maltose; Finetose; Finetose F; Maltodiose; Sunmalt; Sunmalt S

Condensed phase thermochemistry data

Data compiled by: Eugene S. Domalski and Elizabeth D. Hearing
Constant pressure heat capacity of solid
Cp,solid (cal/mol*K) | Temperature (K) | Reference | Comment |
---|---|---|---|
103.9 | 300. | Kawaizumi, Nishio, et al., 1981 | T = 270 to 325 K. Cp given as 1.27 J/g*K. |

References

Kawaizumi, Nishio, et al., 1981
Kawaizumi, F.; Nishio, N.; Nomura, H.; Miyahara, Y.,
Heat-capacity measurements of aqueous solutions of mono-, di-, and tri-saccharides using an isoperibol twin calorimeter,
J. Chem. Thermodynam., 1981, 13, 89-98. [all data]