Phenol, 2,3,5-trimethyl-
- Formula: C9H12O
- Molecular weight: 136.1910
- IUPAC Standard InChIKey: OGRAOKJKVGDSFR-UHFFFAOYSA-N
- CAS Registry Number: 697-82-5
- Chemical structure:
View 3d structure (requires JavaScript / HTML 5) - Other names: Isopseudocumenol; 1-Hydroxy-2,3,5-trimethylbenzene; 2,3,5-Trimethylphenol

Phase change data

Data compiled as indicated in comments:
BS - Robert L. Brown and Stephen E. Stein
TRC - Thermodynamics Research Center, NIST Boulder Laboratories, Chris Muzny director
AC - William E. Acree, Jr., James S. Chickos
Quantity | Value | Units | Method | Reference | Comment |
---|---|---|---|---|---|
Tboil | 507. ± 4. | K | AVG | N/A | Average of 8 values; Individual data points |
Quantity | Value | Units | Method | Reference | Comment |
Tfus | 368. ± 1. | K | AVG | N/A | Average of 8 values; Individual data points |
Enthalpy of vaporization
ΔvapH (kJ/mol) | Temperature (K) | Method | Reference | Comment |
---|---|---|---|---|
53.9 | 474. | A,GS,EB | Stephenson and Malanowski, 1987 | Based on data from 459. to 521. K. See also Handley, Harrop, et al., 1964.; AC |
55.1 | 394. | N/A | von Terres, Gebert, et al., 1955 | Based on data from 379. to 506. K.; AC |
Antoine Equation Parameters
log10(P) = A − (B / (T + C))
P = vapor pressure (bar)
T = temperature (K)
View plot Requires a JavaScript / HTML 5 canvas capable browser.
Temperature (K) | A | B | C | Reference | Comment |
---|---|---|---|---|---|
459.63 to 520.21 | 4.20528 | 1686.099 | -106.986 | Handley, Harrop, et al., 1964, 2 | Coefficents calculated by NIST from author's data. |
379. to 506. | 5.43933 | 2669.653 | -14.487 | von Terres, Gebert, et al., 1955, 2 | Coefficents calculated by NIST from author's data. |

Kovats' RI, non-polar column, isothermal

View large format table.

Column type Active phase Temperature (C) I Reference Comment
CapillaryOV-1150.1235.Zhang, Chen, et al., 199725. m/0.2 mm/0.33 μm, N2
CapillaryOV-1150.1235.Zhang, Chen, et al., 199725. m/0.2 mm/0.33 μm, N2
CapillaryOV-1150.1236.Zhang, Chen, et al., 199725. m/0.2 mm/0.33 μm, N2
CapillaryOV-1160.1246.Zhang, Chen, et al., 199725. m/0.2 mm/0.33 μm, N2
PackedMethyl Silicone150.1278.Radecki, Grzybowski, et al., 1979

Kovats' RI, non-polar column, custom temperature program

View large format table.

Column type Active phase I Reference Comment
PackedSE-301260.Grzybowski, Lamparczyk, et al., 1980Chromosorb W HMDS (80-100 mesh); Column length: 2.9 m; Program: not specified

Van Den Dool and Kratz RI, non-polar column, temperature ramp

View large format table.

Column type Active phase I Reference Comment
CapillaryDB-51275.Rostad and Pereira, 198630. m/0.26 mm/0.25 μm, He, 50. C @ 4. min, 6. K/min, 300. C @ 20. min

Van Den Dool and Kratz RI, non-polar column, custom temperature program

View large format table.

Column type Active phase I Reference Comment
CapillaryVF-5MS1276.1Mjøs, Meier, et al., 200650. m/0.25 mm/0.25 μm, He; Program: 60C(2min) => 30C/min => 100C => 1C/min =>
CapillaryVF-5MS1277.2Mjøs, Meier, et al., 200650. m/0.25 mm/0.25 μm, He; Program: 60C(2min) => 30C/min => 100C => 2C/min =>
CapillaryVF-5MS1279.7Mjøs, Meier, et al., 200650. m/0.25 mm/0.25 μm, He; Program: 60C(2min) => 30C/min => 100C => 4C/min =>

Van Den Dool and Kratz RI, polar column, temperature ramp

View large format table.

Column type Active phase I Reference Comment
CapillarySupelcowax-102228.Chung, Yung, et al., 200160. m/0.25 mm/0.25 μm, He, 35. C @ 5. min, 2. K/min, 195. C @ 90. min

Normal alkane RI, non-polar column, temperature ramp

View large format table.

Column type Active phase I Reference Comment
CapillaryTR-11247.Gruzdev, Kuzivanov, et al., 201230. m/0.32 mm/0.25 μm, Helium, 5. K/min; Tstart: 50. C; Tend: 300. C
CapillaryDB-51296.Czerny, Brueckner, et al., 201130. m/0.32 mm/0.25 μm, Helium, 40. C @ 2. min, 8. K/min, 250. C @ 5. min
CapillaryUltra-11242.Okumura, 199125. m/0.32 mm/0.25 μm, He, 3. K/min; Tstart: 80. C; Tend: 260. C

Normal alkane RI, non-polar column, custom temperature program

View large format table.

Column type Active phase I Reference Comment
CapillarySE-301260.Peterson, 1992Program: not specified
CapillaryPolydimethyl siloxane, unknown content of Ph-groups1273.Geldon, 1989Program: not specified
CapillaryPolydimethyl siloxane, unknown content of Ph-groups1275.Geldon, 1989Program: not specified

Normal alkane RI, polar column, temperature ramp

View large format table.

Column type Active phase I Reference Comment
CapillaryDB-FFAP2211.Czerny, Brueckner, et al., 201130. m/0.32 mm/0.25 μm, Helium, 40. C @ 2. min, 8. K/min, 230. C @ 5. min

Normal alkane RI, polar column, custom temperature program

View large format table.

Column type Active phase I Reference Comment
CapillaryCarbowax 20M2248.Zimmermann, Lauterbach, et al., 1985Program: not specified

Lee's RI, non-polar column, temperature ramp

View large format table.

Column type Active phase I Reference Comment
CapillaryDB-5214.7Donnelly, Abdel-Hamid, et al., 199330. m/0.32 mm/0.25 μm, He, 40. C @ 3. min, 8. K/min, 285. C @ 29.5 min
CapillaryDB-5217.22Rostad and Pereira, 198630. m/0.26 mm/0.25 μm, He, 50. C @ 4. min, 6. K/min, 300. C @ 20. min

References

Stephenson and Malanowski, 1987
Stephenson, Richard M.; Malanowski, Stanislaw,
Handbook of the Thermodynamics of Organic Compounds, 1987, https://doi.org/10.1007/978-94-009-3173-2
. [all data]
Handley, Harrop, et al., 1964
Handley, R.; Harrop, D.; Martin, J.F.; Sprake, C.H.S.,
846. Thermodynamic properties of organic oxygen compounds. Part XIV. Purification and vapour pressures of some alkylphenols,
J. Chem. Soc., 1964, 4404, https://doi.org/10.1039/jr9640004404
. [all data]
von Terres, Gebert, et al., 1955
von Terres, E.; Gebert, F.; Hulsemann, H.; Petereit, H.; Toepsch, H.; Ruppert, W.,
Brennst.-Chem., 1955, 36, 272. [all data]
Handley, Harrop, et al., 1964, 2
Handley, R.; Harrop, D.; Martin, J.F.; Sprake, C.H.S.,
Thermodynamic Properties of Organic Oxygen Compounds. Part XIV. Purification and Vapour Pressures of Some Alkylphenols,
J. Chem. Soc., 1964, 4404-4406, https://doi.org/10.1039/jr9640004404
. [all data]
von Terres, Gebert, et al., 1955, 2
von Terres, E.; Gebert, F.; Hulsemann, H.; Petereit, H.; Toepsch, H.; Ruppert, W.,
Zur Kenntnis der physikalisch-chemischen Grundlagen der Gewinnung und Zerlegung der Phenolfraktionen von Steinkohlenteer und Braunkohlenschwelteer. IV. Mitteilung Die Dampfdrucke von Phenol und Phenolderivaten,
Brennst.-Chem., 1955, 36, 272-274. [all data]