n-Heptyl hexanoate
- Formula: C13H26O2
- Molecular weight: 214.3443
- IUPAC Standard InChIKey: QEKCBKVWQYEUGY-UHFFFAOYSA-N
- CAS Registry Number: 6976-72-3
- Chemical structure:
View 3d structure (requires JavaScript / HTML 5) - Other names: Hexanoic acid, heptyl ester; heptyl hexanoate

Phase change data

Data compiled by: Thermodynamics Research Center, NIST Boulder Laboratories, Chris Muzny director
Quantity | Value | Units | Method | Reference | Comment |
---|---|---|---|---|---|
Tboil | 534.12 | K | N/A | Bilterys and Gisseleire, 1935 | Uncertainty assigned by TRC = 0.3 K |
Tboil | 532.6 | K | N/A | Gartenmeister, 1886 | Uncertainty assigned by TRC = 3. K |
Quantity | Value | Units | Method | Reference | Comment |
Tfus | 238.9 | K | N/A | Bilterys and Gisseleire, 1935 | Uncertainty assigned by TRC = 0.5 K |

Van Den Dool and Kratz RI, non-polar column, temperature ramp

View large format table.

Column type Active phase I Reference Comment
CapillaryDB-11459.Brat, Brillouet, et al., 200030. m/0.32 mm/0.25 μm, H2, 40. C @ 3. min, 3. K/min, 245. C @ 20. min
CapillaryCP Sil 5 CB1470.Hendriks and Bruins, 19834. K/min; Column length: 25. m; Column diameter: 0.22 mm; Tstart: 70. C; Tend: 205. C

Normal alkane RI, non-polar column, temperature ramp

View large format table.

Column type Active phase I Reference Comment
CapillaryDB-51482.Fan and Qian, 200630. m/0.32 mm/0.25 μm, He, 40. C @ 2. min, 4. K/min, 250. C @ 15. min
CapillaryDB-51482.Fan and Qian, 200630. m/0.32 mm/1. μm, He, 40. C @ 2. min, 4. K/min, 250. C @ 15. min
CapillaryDB-51482.Fan and Qian, 2006, 230. m/0.32 mm/1. μm, N2, 40. C @ 2. min, 6. K/min, 230. C @ 15. min
CapillaryHP-51448.Pino, Sauri-Duch, et al., 200630. m/0.25 mm/0.25 μm, H2, 50. C @ 2. min, 4. K/min, 280. C @ 10. min

Normal alkane RI, polar column, temperature ramp

View large format table.

Column type Active phase I Reference Comment
CapillaryDB-Wax1683.Fan and Qian, 200630. m/0.25 mm/0.25 μm, He, 40. C @ 2. min, 4. K/min, 230. C @ 15. min
CapillaryDB-Wax1683.Fan and Qian, 200630. m/0.32 mm/0.25 μm, He, 40. C @ 2. min, 4. K/min, 230. C @ 15. min
CapillaryDB-Wax1703.Fan and Qian, 2006, 230. m/0.32 mm/0.25 μm, N2, 40. C @ 2. min, 6. K/min, 230. C @ 15. min
CapillaryDB-Wax1706.Fan and Qian, 200530. m/0.32 mm/0.25 μm, N2, 40. C @ 2. min, 4. K/min, 230. C @ 5. min

References

Bilterys and Gisseleire, 1935
Bilterys, R.; Gisseleire, J.,
Investigations on the Congelation Temperature of Organic Compounds,
Bull. Soc. Chim. Belg., 1935, 44, 567. [all data]
Gartenmeister, 1886
Gartenmeister, R.,
Investigation of the physical characterstics of liquid compounds: vi boiling point and specific volume of normal fatty acid esters,
Justus Liebigs Ann. Chem., 1886, 233, 249-315. [all data]