1-Cyclohexene-1-acetonitrile
- Formula: C8H11N
- Molecular weight: 121.1796
- IUPAC Standard InChIKey: OYEXEQFKIPJKJK-UHFFFAOYSA-N
- CAS Registry Number: 6975-71-9
- Chemical structure:
View 3d structure (requires JavaScript / HTML 5) - Other names: Cyclohexenylacetonitrile; 1-Cyclohexen-1-ylacetonitrile; 1-Cyclohexenylacetonitrile; cyclohex-1-ene-1-acetonitrile

Phase change data

Data compiled by: Robert L. Brown and Stephen E. Stein
Reduced pressure boiling point
Tboil (K) | Pressure (bar) | Reference |
---|---|---|
417.2 | 0.12 | Aldrich Chemical Company Inc., 1990 |
383. to 385. | 0.033 | Frinton Laboratories Inc., 1986 |

Reaction thermochemistry data

Data compiled by: Hussein Y. Afeefy, Joel F. Liebman, and Stephen E. Stein
Individual Reactions
By formula: C8H11N = cyclohexylideneacetonitrile
Quantity | Value | Units | Method | Reference | Comment |
---|---|---|---|---|---|
ΔrH° | -11. | kJ/mol | Eqk | Svata and Prochazka, 1975 | liquid phase; solvent: t-Butyl alcohol; Heat of isomerisation |

References

Aldrich Chemical Company Inc., 1990
Aldrich Chemical Company Inc.,
Catalog Handbook of Fine Chemicals, Aldrich Chemical Company, Inc., Milwaukee WI, 1990, 1. [all data]
Frinton Laboratories Inc., 1986
Frinton Laboratories Inc.,
Catalog Number 11, Frinton Laboratories Inc., Vineland, NJ, 1986, 99. [all data]
Svata and Prochazka, 1975
Svata, V.; Prochazka, M.,
Relative stability of alicyclic compounds containing an exocyclic and and endocyclic double bond,
Collect. Czech. Chem. Commun., 1975, 40, 2315-2325. [all data]