Cyclohexene, 1,6,6-trimethyl-
- Formula: C9H16
- Molecular weight: 124.2233
- IUPAC Standard InChIKey: UBMLKGCOROJNMF-UHFFFAOYSA-N
- CAS Registry Number: 69745-49-9
- Chemical structure:
View 3d structure (requires JavaScript / HTML 5) - Species with the same structure:
- Other names: 2,3,3-Trimethylcyclohexene

Phase change data

Data compiled by: Thermodynamics Research Center, NIST Boulder Laboratories, Chris Muzny director
Quantity | Value | Units | Method | Reference | Comment |
---|---|---|---|---|---|
Tboil | 420.0 | K | N/A | Anonymous, 1947 | Uncertainty assigned by TRC = 0.3 K |
Quantity | Value | Units | Method | Reference | Comment |
Tfus | 200.17 | K | N/A | Anonymous, 1947 | Uncertainty assigned by TRC = 0.3 K |

References

Anonymous, 1947
Anonymous, R.,
, Am. Pet. Inst. Res. Proj. 45, Ohio State Univ., 1947. [all data]