Butanoic acid, 4-hexenyl ester, (Z)-
- Formula: C10H18O2
- Molecular weight: 170.2487
- IUPAC Standard InChIKey: IKWWFLZYECOJNB-HYXAFXHYSA-N
- CAS Registry Number: 69727-41-9
- Chemical structure:
View 3d structure (requires JavaScript / HTML 5) - Stereoisomers:
- Other names: (4Z)-4-Hexenyl butyrate; (Z)-4-Hexen-1-yl butanoate; (Z)-4-Hexenyl butyrate

Normal alkane RI, non-polar column, temperature ramp

Column type | Active phase | I | Reference | Comment |
---|---|---|---|---|
Capillary | HP-5 MS | 1203. | Yasuda, Shigehisa, et al., 2008 | 30. m/0.25 mm/0.25 μm, Helium, 50. C @ 2. min, 10. K/min, 250. C @ 5. min |
Capillary | DB-1 | 1177. | Shiota, 1993 | 30. m/0.25 mm/0.25 μm, He, 50. C @ 3. min, 5. K/min; Tend: 240. C |
Capillary | DB-1 | 1180. | Shiota, 1993 | 30. m/0.25 mm/0.25 μm, He, 50. C @ 3. min, 5. K/min; Tend: 240. C |

Normal alkane RI, polar column, temperature ramp

Column type | Active phase | I | Reference | Comment |
---|---|---|---|---|
Capillary | HP-Innowax | 1489. | Yasuda, Shigehisa, et al., 2008 | 30. m/0.25 mm/0.25 μm, Helium, 50. C @ 2. min, 10. K/min, 240. C @ 5. min |

References

Yasuda, Shigehisa, et al., 2008
Yasuda, T.; Shigehisa, S.; Yuasa, K.; Okutani-Akamatsu, Y.; Teramoto, N.; Watanabe, T.; Mochizuki, F.,
Sex attactant pheromone of the sorghum plant bug Stenotus rubrovittatus (Natsumura) (Heteroptera: Miridae),
Appl. Entomol. Zool., 2008, 43, 2, 219-226, https://doi.org/10.1303/aez.2008.219
. [all data]
Shiota, 1993
Shiota, H.,
New esteric components in the volatiles of banana fruit (Musa sapientum L.),
J. Agric. Food Chem., 1993, 41, 11, 2056-2062, https://doi.org/10.1021/jf00035a046
. [all data]